{"text_format":"1","workbook":"xlsx","n_sheets":6,"sheets":["INSTRUCCIONES","DATOS PARA FORMALIZAR CTA","ANEXO I (a)","ANEXO I (b)","ANEXO II","DATOS"],"not_rendered":{"charts":0,"images":17,"macros":1,"external_links":0,"defined_names":4,"comments":0,"pivot_tables":0},"unopened":[],"bounds":{"document_bytes":16777216,"sheet_cells":100000,"rows_first":2000,"rows_last":500,"rows_between":2000,"halvings":0,"cell_chars":16384,"cell_head_chars":4096},"cells_cut":44,"cells_raw":0,"read":"whole","date_system":"1900"}

{"sheet":"INSTRUCCIONES","index":0,"n_rows":59,"n_cols":16,"rows_kept":59,"cut":false,"hidden":false,"merged":[]}
[null,null,null,null,null,null,"INSTRUCCIONES PARA FORMALIZAR CONTRATO TÉCNICO DE ACCESO (CTA-Generación)     "]
["A continuación, se detallan las instrucciones para poder formalizar el CTA:            ",null,null,null,null,null,null,null,null,null,null,null,null,null,{"$f":"'DATOS PARA FORMALIZAR CTA'!E2","v":0}]
["1º.- Cumplimentar las siguientes hojas de este Excel:          ",null,null,null,null,null,null,null,null,null,null,null,null,null,{"$f":"'DATOS PARA FORMALIZAR CTA'!E3","v":0}]
[null,null,"\"DATOS PARA FORMALIZAR CTA\"     ",null,null,null,null,null,null,null,null,null,null,null,{"$f":"'DATOS PARA FORMALIZAR CTA'!E4","v":0}]
[null,null,"\"ANEXOS I (a)\"",null,null,null,null,null,null,null,null,null,null,null,{"$f":"'DATOS PARA FORMALIZAR CTA'!E5","v":0}]
[null,null,"\"ANEXOS I (b)\"",null,null,null,null,null,null,null,null,null,null,null,{"$f":"'DATOS PARA FORMALIZAR CTA'!E6","v":0}]
["2º.- Aportar la siguiente documentación:        ",null,null,null,null,null,null,null,null,null,null,null,null,null,{"$f":"'DATOS PARA FORMALIZAR CTA'!E7","v":0}]
[null,null,">  PUNTO DE CONEXIÓN O ACUERDO CON LA DISTRIBUIDORA.    ",null,null,null,null,null,null,null,null,null,null,null,{"$f":"'DATOS PARA FORMALIZAR CTA'!E8","v":0}]
[null,null,">  ACREDITACIÓN DE LA TITULARIDAD (NIF/CIF; Poderes).     ",null,null,null,null,null,null,null,null,null,null,null,{"$f":"'DATOS PARA FORMALIZAR CTA'!E9","v":0}]
[null,null,">  AUTORIZACIÓN ADMINISTRATIVA, para instalaciones no sujetas al RD 1699/2011.     (>100KW)",null,null,null,null,null,null,null,null,null,null,null,{"$f":"'DATOS PARA FORMALIZAR CTA'!E10","v":0}]
[null,null,">  ESQUEMA UNIFILAR INSTALACIÓN ( en caso de no estar entre los seleccionables)",null,null,null,null,null,null,null,null,null,null,null,{"$f":"'DATOS PARA FORMALIZAR CTA'!E11","v":0}]
[null,null,">  Certificado Instalaciones Eléctricas (CIE) para las instalaciones de pequeña potencia.",null,null,null,null,null,null,null,null,{"$f":"IF('DATOS PARA FORMALIZAR CTA'!$B12:$C12=\"\",0,1)","v":0},0,null,{"$f":"'DATOS PARA FORMALIZAR CTA'!E12","v":0},{"$f":"'DATOS PARA FORMALIZAR CTA'!F2","v":0}]
[null,null,null,null,null,null,null,null,null,null,null,{"$f":"IF('DATOS PARA FORMALIZAR CTA'!$B13:$C13=\"\",0,1)","v":0},0,null,{"$f":"'DATOS PARA FORMALIZAR CTA'!E13","v":0},{"$f":"'DATOS PARA FORMALIZAR CTA'!F3","v":0}]
["3º.- Si dispone de CUPS de Servicios Auxiliares (SSAA), indicarlo en la hoja Excel \"DATOS PARA FORMALIZAR CTA\" en su correspondiente",null,null,null,null,null,null,null,null,null,null,{"$f":"IF('DATOS PARA FORMALIZAR CTA'!$B14:$C14=\"\",0,1)","v":0},0,null,{"$f":"'DATOS PARA FORMALIZAR CTA'!E14","v":0},{"$f":"'DATOS PARA FORMALIZAR CTA'!F4","v":0}]
["apartado. ","En caso contrario, por favor, rellenar la tabla que aparece en la hoja Excel \"SOLICITUD CUPS SSAA\".",null,null,null,null,null,null,null,null,null,{"$f":"IF('DATOS PARA FORMALIZAR CTA'!$B15:$C15=\"\",0,1)","v":0},0,null,{"$f":"'DATOS PARA FORMALIZAR CTA'!E15","v":0},{"$f":"'DATOS PARA FORMALIZAR CTA'!F5","v":0}]
["4º.- Enviar tanto el archivo Excel cumplimentado como la documentación requerida a: ATR-generadores.edistribucion@enel.com  ",null,null,null,null,null,null,null,null,null,null,{"$f":"IF('DATOS PARA FORMALIZAR CTA'!$B16:$C16=\"\",0,1)","v":0},0,null,{"$f":"'DATOS PARA FORMALIZAR CTA'!E16","v":0},{"$f":"'DATOS PARA FORMALIZAR CTA'!F6","v":0}]
[null,null,null,null,null,null,null,null,null,null,null,{"$f":"IF('DATOS PARA FORMALIZAR CTA'!$B17:$C17=\"\",0,1)","v":0},0,null,{"$f":"'DATOS PARA FORMALIZAR CTA'!E17","v":0},{"$f":"'DATOS PARA FORMALIZAR CTA'!F7","v":0}]
[null,null,null,null,null,null,null,null,null,null,null,{"$f":"IF('DATOS PARA FORMALIZAR CTA'!$B18:$C18=\"\",0,1)","v":0},0,null,{"$f":"'DATOS PARA FORMALIZAR CTA'!E18","v":0},{"$f":"'DATOS PARA FORMALIZAR CTA'!F8","v":0}]
[null,null,null,null,null,null,null,null,null,null,null,{"$f":"IF('DATOS PARA FORMALIZAR CTA'!$B19:$C19=\"\",0,1)","v":0},0,null,{"$f":"'DATOS PARA FORMALIZAR CTA'!E19","v":0},{"$f":"'DATOS PARA FORMALIZAR CTA'!F9","v":0}]
[null,null,null,null,null,null,null,null,null,null,null,{"$f":"IF('DATOS PARA FORMALIZAR CTA'!$B20:$C20=\"\",0,1)","v":0},0,null,{"$f":"'DATOS PARA FORMALIZAR CTA'!E20","v":0},{"$f":"'DATOS PARA FORMALIZAR CTA'!F10","v":0}]
[null,null,null,null,null,null,null,null,null,null,null,{"$f":"IF('DATOS PARA FORMALIZAR CTA'!$B21:$C21=\"\",0,1)","v":0},0,null,{"$f":"'DATOS PARA FORMALIZAR CTA'!E21","v":0},{"$f":"'DATOS PARA FORMALIZAR CTA'!F11","v":0}]
[null,null,null,null,null,null,null,null,null,null,null,{"$f":"IF('DATOS PARA FORMALIZAR CTA'!$B22:$C22=\"\",0,1)","v":0},0,null,{"$f":"'DATOS PARA FORMALIZAR CTA'!E23","v":"VACIO"},{"$f":"'DATOS PARA FORMALIZAR CTA'!F12","v":0}]
[null,null,null,null,null,null,null,null,null,null,null,{"$f":"IF('DATOS PARA FORMALIZAR CTA'!$B23:$C23=\"\",0,1)","v":0},0,null,{"$f":"'DATOS PARA FORMALIZAR CTA'!E24","v":""},{"$f":"'DATOS PARA FORMALIZAR CTA'!F13","v":0}]
[null,null,null,null,null,null,null,null,null,null,null,{"$f":"IF('DATOS PARA FORMALIZAR CTA'!$B24:$C24=\"\",0,1)","v":0},0,null,{"$f":"'DATOS PARA FORMALIZAR CTA'!E25","v":""},{"$f":"'DATOS PARA FORMALIZAR CTA'!F14","v":0}]
[null,null,null,null,null,null,null,null,null,null,null,{"$f":"IF('DATOS PARA FORMALIZAR CTA'!$B25:$C25=\"\",0,1)","v":0},0,null,null,{"$f":"'DATOS PARA FORMALIZAR CTA'!F15","v":0}]
[null,null,null,null,null,null,null,null,null,null,null,{"$f":"IF('DATOS PARA FORMALIZAR CTA'!$B26:$C26=\"\",0,1)","v":0},0,null,null,{"$f":"'DATOS PARA FORMALIZAR CTA'!F16","v":0}]
[null,null,null,null,null,null,null,null,null,null,null,{"$f":"IF('DATOS PARA FORMALIZAR CTA'!$B27:$C27=\"\",0,1)","v":0},0,null,null,{"$f":"'DATOS PARA FORMALIZAR CTA'!F17","v":0}]
[null,null,null,null,null,null,null,null,null,null,null,{"$f":"IF('DATOS PARA FORMALIZAR CTA'!$B28:$C28=\"\",0,1)","v":0},0,null,null,{"$f":"'DATOS PARA FORMALIZAR CTA'!F19","v":0}]
[null,null,null,null,null,null,null,null,null,null,null,{"$f":"IF('DATOS PARA FORMALIZAR CTA'!$B29:$C29=\"\",0,1)","v":0},0,null,{"$f":"'DATOS PARA FORMALIZAR CTA'!O29","v":0},{"$f":"'DATOS PARA FORMALIZAR CTA'!F20","v":0}]
[null,null,null,null,null,null,null,null,null,null,null,{"$f":"IF('DATOS PARA FORMALIZAR CTA'!$B30:$C30=\"\",0,1)","v":0},0,null,{"$f":"'DATOS PARA FORMALIZAR CTA'!O30","v":0},{"$f":"'DATOS PARA FORMALIZAR CTA'!F21","v":0}]
[null,null,null,null,null,null,null,null,null,null,null,{"$f":"IF('DATOS PARA FORMALIZAR CTA'!$B31:$C31=\"\",0,1)","v":0},0,null,{"$f":"'DATOS PARA FORMALIZAR CTA'!O31","v":0},{"$f":"'DATOS PARA FORMALIZAR CTA'!F22","v":0}]
[null,null,null,null,null,null,null,null,null,null,null,{"$f":"IF('DATOS PARA FORMALIZAR CTA'!$B32:$C32=\"\",0,1)","v":0},0,null,{"$f":"'DATOS PARA FORMALIZAR CTA'!O32","v":0},{"$f":"'DATOS PARA FORMALIZAR CTA'!F23","v":0}]
[null,null,null,null,null,null,null,null,null,null,null,{"$f":"IF('DATOS PARA FORMALIZAR CTA'!$B33:$C33=\"\",0,1)","v":0},0,null,{"$f":"'DATOS PARA FORMALIZAR CTA'!O33","v":0},{"$f":"'DATOS PARA FORMALIZAR CTA'!F24","v":0}]
[null,null,null,null,null,null,null,null,null,null,null,{"$f":"IF('DATOS PARA FORMALIZAR CTA'!$B34:$C34=\"\",0,1)","v":0},0,null,{"$f":"'DATOS PARA FORMALIZAR CTA'!O34","v":0},{"$f":"'DATOS PARA FORMALIZAR CTA'!F25","v":0}]
[null,null,null,null,null,null,null,null,null,null,null,{"$f":"IF('DATOS PARA FORMALIZAR CTA'!$B35:$C35=\"\",0,1)","v":0},0,null,{"$f":"'DATOS PARA FORMALIZAR CTA'!O35","v":0},{"$f":"'DATOS PARA FORMALIZAR CTA'!P35","v":0}]
[null,null,null,null,null,null,null,null,null,null,null,{"$f":"IF('DATOS PARA FORMALIZAR CTA'!$B36:$C36=\"\",0,1)","v":0},0,null,{"$f":"'DATOS PARA FORMALIZAR CTA'!O36","v":0}]
[null,null,null,null,null,null,null,null,null,null,null,{"$f":"IF('DATOS PARA FORMALIZAR CTA'!$B37:$C37=\"\",0,1)","v":0},0,null,{"$f":"'DATOS PARA FORMALIZAR CTA'!O37","v":0}]
[null,null,null,null,null,null,null,null,null,null,null,{"$f":"IF('DATOS PARA FORMALIZAR CTA'!$B38:$C38=\"\",0,1)","v":0},0,null,{"$f":"'DATOS PARA FORMALIZAR CTA'!O38","v":0}]
[null,null,null,null,null,null,null,null,null,null,null,{"$f":"IF('DATOS PARA FORMALIZAR CTA'!$B39:$C39=\"\",0,1)","v":0},0,null,{"$f":"'DATOS PARA FORMALIZAR CTA'!O39","v":0}]
[null,null,null,null,null,null,null,null,null,null,null,{"$f":"IF('DATOS PARA FORMALIZAR CTA'!$B40:$C40=\"\",0,1)","v":0},0,null,{"$f":"'DATOS PARA FORMALIZAR CTA'!O40","v":0}]
[null,null,null,null,null,null,null,null,null,null,null,{"$f":"IF('DATOS PARA FORMALIZAR CTA'!$B41:$C41=\"\",0,1)","v":0},0,null,{"$f":"'DATOS PARA FORMALIZAR CTA'!O41","v":0}]
[null,null,null,null,null,null,null,null,null,null,null,{"$f":"IF('DATOS PARA FORMALIZAR CTA'!$B42:$C42=\"\",0,1)","v":0},0,null,{"$f":"'DATOS PARA FORMALIZAR CTA'!O42","v":0}]
[null,null,null,null,null,null,null,null,null,null,null,{"$f":"IF('DATOS PARA FORMALIZAR CTA'!$B43:$C43=\"\",0,1)","v":0},0,null,{"$f":"'DATOS PARA FORMALIZAR CTA'!O43","v":0}]
[null,null,null,null,null,null,null,null,null,null,null,{"$f":"IF('DATOS PARA FORMALIZAR CTA'!$B44:$C44=\"\",0,1)","v":0},0,null,{"$f":"'DATOS PARA FORMALIZAR CTA'!O44","v":0}]
[null,null,null,null,null,null,null,null,null,null,null,{"$f":"IF('DATOS PARA FORMALIZAR CTA'!$B45:$C45=\"\",0,1)","v":0},0,null,{"$f":"'DATOS PARA FORMALIZAR CTA'!O45","v":0}]
[null,null,null,null,null,null,null,null,null,null,null,{"$f":"IF('DATOS PARA FORMALIZAR CTA'!$B46:$C46=\"\",0,1)","v":0},0,null,{"$f":"'DATOS PARA FORMALIZAR CTA'!O46","v":0}]
[null,null,null,null,null,null,null,null,null,null,null,{"$f":"IF('DATOS PARA FORMALIZAR CTA'!$B47:$C47=\"\",0,1)","v":0},0,null,{"$f":"'DATOS PARA FORMALIZAR CTA'!O47","v":0},{"$f":"'DATOS PARA FORMALIZAR CTA'!P47","v":0}]
[null,null,null,null,null,null,null,null,null,null,null,{"$f":"IF('DATOS PARA FORMALIZAR CTA'!$B48:$C48=\"\",0,1)","v":0},0]
[null,null,null,null,null,null,null,null,null,null,null,{"$f":"IF('DATOS PARA FORMALIZAR CTA'!$B49:$C49=\"\",0,1)","v":0},0]
[null,null,null,null,null,null,null,null,null,null,null,{"$f":"IF('DATOS PARA FORMALIZAR CTA'!$B50:$C50=\"\",0,1)","v":0},0]
[null,null,null,null,null,null,null,null,null,null,null,{"$f":"IF('DATOS PARA FORMALIZAR CTA'!$B51:$C51=\"\",0,1)","v":0},0]
[null,null,null,null,null,null,null,null,null,null,null,{"$f":"IF('DATOS PARA FORMALIZAR CTA'!$B52:$C52=\"\",0,1)","v":1},1]
[null,null,null,null,null,null,null,null,null,null,null,{"$f":"IF('DATOS PARA FORMALIZAR CTA'!$B53:$C53=\"\",0,1)","v":1},1]
[null,null,null,null,null,null,null,null,null,null,null,{"$f":"IF('DATOS PARA FORMALIZAR CTA'!$B54:$C54=\"\",0,1)","v":1},1]
[null,null,null,null,null,null,null,null,null,null,null,{"$f":"IF('DATOS PARA FORMALIZAR CTA'!$B55:$C55=\"\",0,1)","v":1},1]
[null,null,null,null,null,null,null,null,null,null,null,{"$f":"IF('DATOS PARA FORMALIZAR CTA'!$B84:$C84=\"\",0,1)","v":1},0,"COEF REDU"]
[null,null,null,null,null,null,null,null,null,null,null,{"$f":"'DATOS PARA FORMALIZAR CTA'!B12:C12","v":0},0]
[null,null,null,null,null,null,null,null,null,null,null,{"$f":"'DATOS PARA FORMALIZAR CTA'!B13:C13","v":0},0]
[null,null,null,null,null,null,null,null,null,null,null,{"$f":"'DATOS PARA FORMALIZAR CTA'!C5","v":0},"UNIFILAR"]

{"sheet":"DATOS PARA FORMALIZAR CTA","index":1,"n_rows":131,"n_cols":16,"rows_kept":131,"cut":false,"hidden":false,"merged":[[55,3,56,9],[58,0,58,2],[62,1,62,2],[57,1,57,2],[22,1,22,2],[33,1,33,2],[35,1,35,2],[45,1,45,2],[44,1,44,2],[42,1,42,2],[41,1,41,2],[25,1,25,2],[26,1,26,2],[28,1,28,2],[23,0,23,2],[29,1,29,2],[0,3,5,3],[5,0,5,2],[27,0,27,2],[34,0,34,2],[20,1,20,2],[21,1,21,2],[30,1,30,2],[15,1,15,2],[16,1,16,2],[19,1,19,2],[18,1,18,2],[24,1,24,2],[0,0,3,0],[0,1,3,2],[12,1,12,2],[14,1,14,2],[10,1,10,2],[6,1,6,2],[7,1,7,2],[8,1,8,2],[9,1,9,2],[81,1,81,2],[83,1,83,2],[82,1,82,2],[64,1,64,2],[65,1,65,2],[66,1,66,2],[67,1,67,2],[68,1,68,2],[69,1,69,2],[70,1,70,2],[71,1,71,2],[72,1,72,2],[73,1,73,2],[74,1,74,2],[75,1,75,2],[80,1,80,2],[13,1,13,2],[31,1,31,2],[78,1,78,2],[79,1,79,2],[11,1,11,2],[36,1,36,2],[46,0,46,2],[47,1,47,2],[48,1,48,2],[49,1,49,2],[17,1,17,2],[32,1,32,2],[77,1,77,2],[40,1,40,2],[50,0,50,2],[37,1,37,2],[76,1,76,2],[43,1,43,2],[38,1,38,2],[39,1,39,2],[63,1,63,2],[59,0,59,2],[61,1,61,2],[60,1,60,2]]}
["SOLICITUD CTA 2023"]
[null,null,null,null,{"$f":"'ANEXO I (a)'!B2:D2","v":0},0,0]
[null,null,null,null,{"$f":"'ANEXO I (a)'!B3:D3","v":0},0,0]
[null,null,null,null,{"$f":"'ANEXO I (a)'!B4:D4","v":0},0,0]
[null,null,{"$f":"'ANEXO I (b)'!X7","v":0},null,{"$f":"'ANEXO I (a)'!B5:D5","v":0},0,0]
["DATOS GENERALES DE LA INSTALACIÓN DE GENERACIÓN",null,null,null,{"$f":"'ANEXO I (a)'!B6:D6","v":0},0,0]
["FECHA",null,null,"No rellenar, datos distribuidora (dia de emision de CTA)",{"$f":"'ANEXO I (a)'!B7:D7","v":0},0,0]
["NOMBRE DE LA INSTALACIÓN ",null,null,"No rellenar, datos distribuidora (Ejm; FV_MANUEL_MARTINEZ)",{"$f":"'ANEXO I (a)'!B8:D8","v":0},0,0]
["CAU (CÓDIGO AUTOCONSUMO): ",null,null,"No rellenar, datos distribuidora",{"$f":"'ANEXO I (a)'!B9:D9","v":0},0,0]
["REF.  INSTALACIÓN GENERACIÓN:",null,null,"No rellenar, datos distribuidora",{"$f":"'ANEXO I (a)'!B10:D10","v":0},0,0]
["CÓDIGO CIL: (SÓLO PARA INST. CON EXCEDENTES S2-B1 Y S2-B2)",null,null,"No rellenar, datos distribuidora",{"$f":"'ANEXO I (a)'!B11:D11","v":0},0,0]
["EXPEDIENTE NNSS/PERMISO ACCESO Y CONEXION",null,null,"NÚMERO DE EXPEDIENTE",{"$f":"'ANEXO I (a)'!B12:D12","v":0},0,0]
["CUPS CONSUMO ASOCIADO: ",null,null,"Ejm; cups 22 digitios ES0031300534980009FH0F",{"$f":"'ANEXO I (a)'!B13:D13","v":0},0,0]
["CUPS SSAA: (SÓLO AUTOCONSUMOS CON EXCEDENTES, QUE NO UNIFIQUEN EL CONSUMO)",null,null,"Ejm; cups 22 digitios ES0031300534980009FH0F",{"$f":"'ANEXO I (a)'!B14:D14","v":0},0,0]
["TIPO AUTOCONSUMO: ",null,null,"Desplegable",{"$f":"'ANEXO I (a)'!B15:D15","v":0},0,0]
["TIPO AUTOCONSUMO: CON EXCEDENTES ",null,null,"Desplegable",{"$f":"'ANEXO I (a)'!B16:D16","v":0},0,0]
["CONTRATO TÉCNICO PARA INSTALACIONES DE GENERACIÓN DE ENERGÍA ELÉCTRICA PRODUCIDA A PARTIR DE FUENTE DE ENERGÍA RENOVABLE",null,null,"Desplegable",{"$f":"'ANEXO I (a)'!B17:D17","v":0},0,0]
["TENSION DE CONEXIÓN A LA RED ENDESA  (Conforme condiciones conexión Endesa) (kV)",null,null,null,{"$f":"'ANEXO I (a)'!B18:D18","v":0},0,0]
["KW INSTALACIÓN DE GENERACIÓN",null,null,"Como máximo la potencia que indica el otorgamiento de industria y las condiciones de conexión de Endesa",{"$f":"'ANEXO I (a)'!B19:D19","v":0},0,0]
["LOCALIZACION INSTALACION DE GENERACION",null,null,"(Dirección de la instalación que indica el otorgamiento de industria)",{"$f":"'ANEXO I (a)'!B20:D20","v":0},0,0]
["TERMINO MUNICIAL DIRECCION DE INSTALACION ",null,null,null,{"$f":"'ANEXO I (a)'!B21:D21","v":0},0,0,null,null,null,null,"tipo de cable","resistencia electrica"]
["CÓDIGO POSTAL DIRECCIÓN INSTALACIÓN",null,null,null,{"$f":"'ANEXO I (a)'!B22:D22","v":0},0,0,null,null,null,null,"LA-30",1.075]
["PROVINCIA",null,null,"Desplegable",{"$f":"'ANEXO I (a)'!B23:D23","v":"VACIO"},0,0]
["COORDENADAS UTM",null,null,null,{"$f":"'ANEXO I (a)'!B24:D24","v":""},0,0,null,null,null,null,"LA-40",0.77800000000000002]
["X",null,null,null,{"$f":"'ANEXO I (a)'!B25:D25","v":""},0,0,null,null,null,null,"LA-56",0.61360000000000003]
["Y",null,null,null,{"$f":"'ANEXO I (a)'!B26:D26","v":""},0,0,null,null,null,null,"CF-LA56-OL",0.61360000000000003]
["HUSO",null,null,null,{"$f":"'ANEXO I (a)'!B27:D27","v":""},0,0,null,null,null,null,"LA-78",0.42609999999999998]
["PERSONA FISICA",null,null,null,{"$f":"SUM(E29:E34)","v":0},null,null,null,null,null,null,"95",0.35199999999999998]
["NOMBRE DEL TITULAR DE LA INSTALACIÓN",null,null,"Sólo rellenar en caso de que se trate de una persona fisica.",{"$f":"IF(B29=\"\",0,1)","v":0},null,null,null,null,null,null,"LA-110",0.307,null,{"$f":"IF(B29=\"\",0,1)","v":0}]
["NIF/CIF DEL TITULAR",null,null,null,{"$f":"IF(B30=\"\",0,1)","v":0},null,null,null,null,null,null,"PENGUIN",0.26769999999999999,null,{"$f":"IF(B30=\"\",0,1)","v":0}]
["DIRECCIÓN DOMICILIO TITULAR",null,null,null,0,null,null,null,null,null,null,"SPARVIERO",0.25700000000000001,null,0]
["TERMINO MUNICIAL ",null,null,null,0,null,null,null,null,null,null,null,null,null,0]
["CÓDIGO POSTAL",null,null,null,{"$f":"IF(B33=\"\",0,1)","v":0},null,null,null,null,null,null,null,null,null,{"$f":"IF(B33=\"\",0,1)","v":0}]
["PROVINCIA",null,null,"Desplegable",{"$f":"IF(B34=\"\",0,1)","v":0},null,null,null,null,null,null,null,null,null,{"$f":"IF(B34=\"\",0,1)","v":0}]
["PERSONA JURIDICA",null,null,null,0,null,null,null,null,null,null,"LA-145",0.24199999999999999,null,{"$f":"SUM(O29:O34)","v":0},{"$f":"IF(O35=6,1,0)","v":0}]
["NOMBRE DE LA EMPRESA TITULAR",null,null,"Sólo rellenar en caso de que se trate de una empresa.",{"$f":"IF(B36=\"\",0,1)","v":0},null,null,null,null,null,null,null,null,null,{"$f":"IF(B36=\"\",0,1)","v":0}]
["CIF EMPRESA TITULAR",null,null,null,{"$f":"IF(B37=\"\",0,1)","v":0},null,null,null,null,null,null,null,null,null,{"$f":"IF(B37=\"\",0,1)","v":0}]
["NOMBRE REPRESENTANTE TITULAR",null,null,null,0,null,null,null,null,null,null,"LA-180",0.19600000000000001,null,{"$f":"IF(B38=\"\",0,1)","v":0}]
["DNI REPRESENTANTE TITULAR",null,null,null,0,null,null,null,null,null,null,"PIPER",0.19,null,0]
["NOTARIO ESCRITURA PODERES",null,null,null,0,null,null,null,null,null,null,"250 UNE",0.124,null,0]
["FECHA ESCRITURA PODERES",null,null,null,0,null,null,null,null,null,null,"LA-280 HAWK",0.11899999999999999,null,0]
["NUMERO DE PROTOCUOLO ESCRITURA PODERES",null,null,null,0,null,null,null,null,null,null,"LA-380 GULL",8.5699999999999998E-2,null,0]
["DIRECCIÓN DOMICILIO ",null,null,null,0,null,null,null,null,null,null,null,null,null,0]
["TERMINO MUNICIAL ",null,null,null,0,null,null,null,null,null,null,null,null,null,0]
["CÓDIGO POSTAL",null,null,null,0,null,null,null,null,null,null,null,null,null,0]
["PROVINCIA",null,null,"Desplegable",0,null,null,null,null,null,null,null,null,null,0]
["Datos Interlocutor de la instalación a efectos de gestión",null,null,null,null,null,null,null,null,null,null,null,null,null,{"$f":"SUM(O36:O46)","v":0},{"$f":"IF(O47=11,1,0)","v":0}]
["NOMBRE DEL INTERLOCUTOR."]
["TFNO. DEL INTERLOCUTOR."]
["E-MAIL DEL INTERLOCUTOR."]
["Tabla de energías",null,null,null,null,null,null,null,null,null,null,"LA-455 CONDOR",7.1800000000000003E-2]
[null,"Energía anual (kWh)      ","Potencia máxima (kW)","Estos valores son estimativos, sus valores pueden diferir a los siguientes del ejemplo.",null,null,null,null,null,null,null,"RAIL",5.9799999999999999E-2]
["PRODUCIDA",{"$f":"+C53*1900","v":68400},36,"Ejemplo; Si no se disponde del dato; En España hay 2500 horas aprox de sol, se calcula aproximadamente unas 1900 efectivas y multiplicamos por la P.Máx.",null,null,null,null,null,null,null,"LA-545 CARDINAL",5.96E-2]
["AUTOCONSUMIDA",{"$f":"+C54*1600","v":57600},36,"Ejemplo; si no se dispone del dato; sobre el calculo anterior se considera una perdida de 300h y se multiplica por la P. Máx.",null,null,null,null,null,null,null,"LA-635 FINCH",5.11E-2]
["ENTREGADA",{"$f":"B53-B54","v":10800},36,"Ejemplo; si no se dispone del dato; diferencia entre Producida y autoconsumida",null,null,null,null,null,null,null,"C50",0.35899999999999999]
["ADQUIRIDA (Consumo Asociado)",null,null,null,null,null,null,null,null,null,null,"C95",0.189]
["ADQUIRIDA (Consumos Generación)",null,null,null,null,null,null,null,null,null,null,"AL 1x 95 Mm2",0.32]
[null,null,null,null,null,null,null,null,null,null,null,"AL 1x150 Mm2",0.20599999999999999]
["A cumplimentar solo por los contratos en Media tensión:",null,null,"A cumplimentar solo por los contratos en Media tensión:",null,null,null,null,null,null,null,"AL 1x240 Mm2",0.125]
["La especificación de varios tramos es para casos donde haya 2 tipos de cable distintos.",null,null,null,null,null,null,null,null,null,null,"AL 1x400 Mm2",0.10199999999999999]
["Total Potencia nominal inversores (kW)"]
["Tensión de conexión a la red de Endesa (Conforme condiciones conexión Endesa) (kV)"]
["Tensión de Baja ",0.4]
["Distancia del equipo de baja tensión al transformador 1er Tramo",0]
["Tipo de cable del equipo de baja tensión al transformador 1er Tramo",null,null,"desplegable"]
["Resistencia Baja Tensión 1er Tramo",{"$f":"IF(ISERROR(VLOOKUP($B$65,$I:$J,2,FALSE)),0,(VLOOKUP($B$65,$I:$J,2,FALSE)))","v":0},null,"No tocar",null,null,null,null,"tipo de cable","resistencia conductor"]
["Perdidas Baja Tensión 1er Tramo (%)",{"$f":"B66*(B64/1000)*($B$61)/($B$63^2)/1000*100","v":0},null,"No tocar",null,null,null,null,"AL 3x 1x 16 Mm2",1.91]
["Distancia (m) del equipo de baja tensión al transformador 2º Tramo",0,null,null,null,null,null,null,"AL 3x 1x 25 Mm2",1.2]
["Tipo de cable del equipo de baja tensión al transformador 2º Tramo",null,null,"desplegable",null,null,null,null,"AL 3x 1x 35 Mm2",0.86799999999999999]
["Resistencia Baja Tensión 2º Tramo",{"$f":"IF(ISERROR(VLOOKUP($B$69,$I:$J,2,FALSE)),0,(VLOOKUP($B$69,$I:$J,2,FALSE)))","v":0},null,"No tocar",null,null,null,null,"AL 3x 1x 50 Mm2",0.64100000000000001]
["Perdidas Baja Tensión 2º Tramo (%)",{"$f":"B70*(B70/1000)*($B$61)/($B$63^2)/1000*100","v":0},null,"No tocar",null,null,null,null,"AL 3x 1x 70 Mm2",0.443]
["Total perdidas Baja Tensión (%)",{"$f":"SUM(B67+B71)","v":0},null,"No tocar",null,null,null,null,"AL 3x 1x 95 Mm2",0.32]
["Perdidas Transformador (%)",{"$f":"IF(B62<1,0,2.5)","v":0},null,null,null,null,null,null,"AL 3x 1x120 Mm2",0.253]
["Distancia (m) del transformador al pto de conexión con Endesa (MT) 1er Tramo",0,null,null,null,null,null,null,"AL 3x 1x150 Mm2",0.20599999999999999]
["Tipo de cable del transformador al punto de conexión con Endesa (MT) 1er Tramo","tipo de cable",null,null,null,null,null,null,"AL 3x 1x185 Mm2",0.16400000000000001]
["Resistencia Media Tensión 1er Tramo",{"$f":"IF(ISERROR(VLOOKUP($B$75,$L:$M,2,FALSE)),0,(VLOOKUP($B$75,$L:$M,2,FALSE)))","v":"resistencia electrica"},null,"No tocar",null,null,null,null,"AL 3x 1x240 Mm2",0.125]
["Perdidas Media Tensión 1er Tramo (%)",{"$f":"IF(ISERROR(B76*(B74/1000)*($B$61)/($B$62^2)/1000*100),0,(B76*(B74/1000)*($B$61)/($B$62^2)/1000*100))","v":0},null,"No tocar",null,null,null,null,"AL 3x 1x300 Mm2",0.1]
["Distancia (m) del transformador al punto de conexión con Endesa (MT) 2º Tramo",0,null,null,null,null,null,null,"Cu 1x 1,5 Mm2",12.1]
["Tipo de cable del transformador al punto de conexión con Endesa (MT) 2º Tramo","tipo de cable",null,null,null,null,null,null,"Cu 1x 2,5 Mm2",7.41]
["Resistencia Media Tensión 2º Tramo",{"$f":"IF(ISERROR(VLOOKUP($B$79,$L:$M,2,FALSE)),0,(VLOOKUP($B$79,$L:$M,2,FALSE)))","v":"resistencia electrica"},null,"No tocar",null,null,null,null,"Cu 1x 4 Mm2",4.6100000000000003]
["Perdidas Media Tensión 2º Tramo (%)",{"$f":"IF(ISERROR(B80*(B78/1000)*($B$61)/($B$62^2)/1000*100),0,(B80*(B78/1000)*($B$61)/($B$62^2)/1000*100))","v":0},null,"No tocar",null,null,null,null,"Cu 1x 6 Mm2",3.08]
["Total perdidas Media Tensión (%)",{"$f":"SUM(B77+B81)","v":0},null,"No tocar",null,null,null,null,"Cu 1x10 Mm2",1.83]
["TOTAL PERDIDAS (%)",{"$f":"IF(B62<1,0,SUM(B67+B71+B73+B77+B81))","v":0},null,"No tocar",null,null,null,null,"Cu 1x16 Mm2",1.1499999999999999]
["COEFICIENTE REDUCTOR",{"$f":"(1-(B83/100))","v":1},null,"No tocar",null,null,null,null,"Cu 1x 25 Mm2",0.72699999999999998]
[null,null,null,null,null,null,null,null,"Cu 1x 35 Mm2",0.52400000000000002]
[null,null,null,null,null,null,null,null,"Cu 1x 50 Mm2",0.38700000000000001]
[null,null,null,null,null,null,null,null,"Cu 1x 70 Mm2",0.26800000000000002]
[null,null,null,null,null,null,null,null,"Cu 1x 95 Mm2",0.193]
[null,null,null,null,null,null,null,null,"Cu 1x 120 Mm2",0.153]
[null,null,null,null,null,null,null,null,"Cu 1x 150 Mm2",0.124]
[null,null,null,null,null,null,null,null,"Cu 1x 185 Mm2",9.9099999999999994E-2]
[null,null,null,null,null,null,null,null,"Cu 1x 240 Mm2",7.5399999999999995E-2]
[null,null,null,null,null,null,null,null,"Cu 1x 300 Mm2",6.0100000000000001E-2]
[null,null,null,null,null,null,null,null,"Cu 1x 400 Mm2",4.7E-2]
[null,null,null,null,null,null,null,null,"Cu 2x 1,5 Mm2",12.1]
[null,null,null,null,null,null,null,null,"Cu 2x 2,5 Mm2",7.41]
[null,null,null,null,null,null,null,null,"Cu 2x 4 Mm2",4.6100000000000003]
[null,null,null,null,null,null,null,null,"Cu 2x 6 Mm2",3.08]
[null,null,null,null,null,null,null,null,"Cu 2x 10 Mm2",1.83]
[null,null,null,null,null,null,null,null,"Cu 2x 16 Mm2",1.1499999999999999]
[null,null,null,null,null,null,null,null,"Cu 2x 25 Mm2",0.72699999999999998]
[null,null,null,null,null,null,null,null,"Cu 2x 35 Mm2",0.52400000000000002]
[null,null,null,null,null,null,null,null,"Cu 2x 50 Mm2",0.38700000000000001]
[null,null,null,null,null,null,null,null,"Cu 3x 15 Mm2",12.1]
[null,null,null,null,null,null,null,null,"Cu 3x 2,5 Mm2",7.41]
[null,null,null,null,null,null,null,null,"Cu 3x 4 Mm2",4.6100000000000003]
[null,null,null,null,null,null,null,null,"Cu 3x 6 Mm2",3.08]
[null,null,null,null,null,null,null,null,"Cu 3x 10 Mm2",1.83]
[null,null,null,null,null,null,null,null,"Cu 3x 16 Mm2",1.1499999999999999]
[null,null,null,null,null,null,null,null,"Cu 3x 25 Mm2",0.72699999999999998]
[null,null,null,null,null,null,null,null,"Cu 3x 35 Mm2",0.52400000000000002]
[null,null,null,null,null,null,null,null,"Cu 3x 50 Mm2",0.38700000000000001]
[null,null,null,null,null,null,null,null,"Cu 3x 70 Mm2",0.26800000000000002]
[null,null,null,null,null,null,null,null,"Cu 3x 95 Mm2",0.193]
[null,null,null,null,null,null,null,null,"Cu 3x 120 Mm2",0.153]
[null,null,null,null,null,null,null,null,"Cu 3x 150 Mm2",0.124]
[null,null,null,null,null,null,null,null,"Cu 3x 185 Mm2",9.9099999999999994E-2]
[null,null,null,null,null,null,null,null,"Cu 3x 240 Mm2",7.5399999999999995E-2]
[null,null,null,null,null,null,null,null,"Cu 3x 300 Mm2",6.0100000000000001E-2]
[null,null,null,null,null,null,null,null,"Cu 3x 400 Mm2",4.7E-2]
[null,null,null,null,null,null,null,null,"Cu 4x 1,5 Mm2",12.1]
[null,null,null,null,null,null,null,null,"Cu 4x 2,5 Mm2",7.41]
[null,null,null,null,null,null,null,null,"Cu 4x 4 Mm2",4.6100000000000003]
[null,null,null,null,null,null,null,null,"Cu 4x 6 Mm2",3.08]
[null,null,null,null,null,null,null,null,"Cu 4x 10 Mm2",1.83]
[null,null,null,null,null,null,null,null,"Cu 4x 16 Mm2",1.1499999999999999]
[null,null,null,null,null,null,null,null,"Cu 4x 25 Mm2",0.72699999999999998]
[null,null,null,null,null,null,null,null,"Cu 4x 35 Mm2",0.52400000000000002]
[null,null,null,null,null,null,null,null,"Cu 4x 50 Mm2",0.38700000000000001]
[null,null,null,null,null,null,null,null,"Cu 4x70 Mm2",0.26800000000000002]
[null,null,null,null,null,null,null,null,"Cu 4x 95 Mm2",0.193]

{"sheet":"ANEXO I (a)","index":2,"n_rows":66,"n_cols":16,"rows_kept":66,"cut":false,"hidden":false,"merged":[[60,0,60,3],[10,1,10,3],[11,1,11,3],[9,1,9,3],[0,0,0,3],[3,1,3,3],[4,1,4,3],[5,1,5,3],[6,1,6,3],[7,1,7,3],[8,1,8,3],[2,0,2,3],[12,1,12,3],[14,1,14,3],[15,1,15,3],[13,0,13,3],[16,1,16,3],[17,1,17,3],[18,1,18,3],[19,1,19,3],[20,1,20,3],[25,1,25,3],[23,1,23,3],[24,1,24,3],[21,0,21,3],[22,1,22,3],[26,1,26,3],[27,1,27,3],[35,1,35,3],[36,1,36,3],[28,1,28,3],[30,1,30,3],[29,1,29,3],[32,1,32,3],[33,1,33,3],[34,1,34,3],[52,1,52,3],[53,1,53,3],[44,1,44,3],[45,1,45,3],[46,1,46,3],[47,1,47,3],[48,1,48,3],[49,1,49,3],[50,1,50,3],[41,1,41,3],[37,1,37,3],[38,1,38,3],[39,1,39,3],[51,1,51,3],[1,1,1,3],[65,1,65,3],[55,1,55,3],[56,1,56,3],[57,1,57,3],[58,1,58,3],[59,1,59,3],[61,1,61,3],[62,1,62,3],[63,1,63,3],[64,1,64,3],[54,1,54,3],[43,1,43,3],[42,1,42,3],[31,1,31,3],[40,1,40,3]]}
["I-A).- Características de los equipos de control, conexión seguridad y medida. "]
["Potencia asignada de la instalación (kW) ",null,null,null,"Aviso (P en kw)"]
["2. Equipo generador (detalle para cada grupo generador)"]
["Fabricante  "]
["Modelo  "]
["Potencia máxima, Pmáx (W) "]
["Potencia instalada o potencia pico, Ppic (W)  "]
["Tensión, V (V) "]
["Corriente de máxima potencia, Imáx (A)  "]
["Tensión de máxima potencia, Vmáx (V)  "]
["Intensidad de cortocircuito. Isc (A)  "]
["Número total de equipos ",null,null,null,null,{"$f":"'ANEXO I (b)'!$AA12","v":0}]
["Número de serie del equipo(s) generador(es)  ",null,null,null,null,{"$f":"'ANEXO I (b)'!$AA13","v":0}]
["3. Protecciones externas",null,null,null,null,{"$f":"'ANEXO I (b)'!$AA14","v":0}]
["Interruptor general.",null,null,null,null,{"$f":"'ANEXO I (b)'!$AA15","v":0}]
["Fabricante  ",null,null,null,null,{"$f":"'ANEXO I (b)'!$AA16","v":0}]
["Modelo  ",null,null,null,null,{"$f":"'ANEXO I (b)'!$AA17","v":0}]
["Tensión nominal, Vn (V)  ",null,null,null,null,{"$f":"'ANEXO I (b)'!$AA18","v":0}]
["Corriente nominal, In (A)  ",null,null,null,null,{"$f":"'ANEXO I (b)'!$AA19","v":0}]
["Poder de corte (KA)  ",null,null,null,null,{"$f":"'ANEXO I (b)'!$AA20","v":0}]
["Relación de protecciones y sus ajustes:",null,null,null,null,{"$f":"'ANEXO I (b)'!$AA21","v":0}]
["4. Aparatos de medida y control",null,null,null,null,{"$f":"'ANEXO I (b)'!$AA22","v":0}]
["Propiedad: Titular/ED  (Elegir una opción)","VACIO",null,null,"Deplegable",{"$f":"'ANEXO I (b)'!$AA23","v":0},null,null,null,{"$f":"B23","v":"VACIO"}]
["Fabricante ",{"$f":"J24","v":""},null,null,"Si el equipo es propiedad de ED, NO RELLENAR.",{"$f":"'ANEXO I (b)'!$AA24","v":0},null,null,null,{"$f":"IF($J23=\"ED\",\"ED\",\"\")","v":""}]
["Modelo ",{"$f":"J25","v":""},null,null,null,{"$f":"'ANEXO I (b)'!$AA25","v":0},null,null,null,{"$f":"$J24","v":""}]
["Número de fabricación ",{"$f":"J26","v":""},null,null,null,{"$f":"'ANEXO I (b)'!$AA26","v":0},null,null,null,{"$f":"$J25","v":""}]
["Relación de intensidad ","",null,null,null,{"$f":"'ANEXO I (b)'!$AA27","v":0},null,null,null,""]
["Tensión ","",null,null,null,{"$f":"'ANEXO I (b)'!$AA28","v":0},null,null,null,""]
["Constante de lectura ","",null,null,null,{"$f":"'ANEXO I (b)'!$AA29","v":0},null,null,null,"",null,null,null,null,{"$f":"'DATOS PARA FORMALIZAR CTA'!O29","v":0}]
["Clase ","",null,null,null,{"$f":"'ANEXO I (b)'!$AA30","v":0},null,null,null,"",null,null,null,null,{"$f":"'DATOS PARA FORMALIZAR CTA'!O30","v":0}]
["Datos de telemedida","",null,null,null,{"$f":"'ANEXO I (b)'!$AA31","v":0},null,null,null,"",null,null,null,null,{"$f":"'DATOS PARA FORMALIZAR CTA'!O31","v":0}]
["·       Nº de teléfono: ","",null,null,null,{"$f":"'ANEXO I (b)'!$AA32","v":0},null,null,null,"",null,null,null,null,{"$f":"'DATOS PARA FORMALIZAR CTA'!O32","v":0}]
["·       Dirección de enlace: ","",null,null,null,{"$f":"'ANEXO I (b)'!$AA33","v":0},null,null,null,"",null,null,null,null,{"$f":"'DATOS PARA FORMALIZAR CTA'!O33","v":0}]
["·       Clave de acceso:  ","",null,null,null,{"$f":"'ANEXO I (b)'!$AA34","v":0},null,null,null,"",null,null,null,null,{"$f":"'DATOS PARA FORMALIZAR CTA'!O34","v":0}]
["Contador ubicado en generación neta. (Indicar, en su caso)","",null,null,null,{"$f":"'ANEXO I (b)'!$AA35","v":0},null,null,null,"",null,null,null,null,{"$f":"'DATOS PARA FORMALIZAR CTA'!O35","v":0},{"$f":"'DATOS PARA FORMALIZAR CTA'!P35","v":0}]
["Propiedad: Titular ","",null,null,null,{"$f":"'ANEXO I (b)'!$AA36","v":0},null,null,null,"",null,null,null,null,{"$f":"'DATOS PARA FORMALIZAR CTA'!O36","v":0}]
["Fabricante ","",null,null,null,{"$f":"'ANEXO I (b)'!$AA37","v":0},null,null,null,"",null,null,null,null,{"$f":"'DATOS PARA FORMALIZAR CTA'!O37","v":0}]
["Modelo ","",null,null,null,{"$f":"'ANEXO I (b)'!$AA38","v":0},null,null,null,"",null,null,null,null,{"$f":"'DATOS PARA FORMALIZAR CTA'!O38","v":0}]
["Número de fabricación ","",null,null,null,{"$f":"'ANEXO I (b)'!$AA39","v":0},null,null,null,"",null,null,null,null,{"$f":"'DATOS PARA FORMALIZAR CTA'!O39","v":0}]
["Relación de intensidad ","",null,null,null,{"$f":"'ANEXO I (b)'!$AA40","v":0},null,null,null,"",null,null,null,null,{"$f":"'DATOS PARA FORMALIZAR CTA'!O40","v":0}]
["Tensión ","",null,null,null,{"$f":"'ANEXO I (b)'!$AA41","v":0},null,null,null,"",null,null,null,null,{"$f":"'DATOS PARA FORMALIZAR CTA'!O41","v":0}]
["Constante de lectura ","",null,null,null,{"$f":"'ANEXO I (b)'!$AA42","v":0},null,null,null,"",null,null,null,null,{"$f":"'DATOS PARA FORMALIZAR CTA'!O42","v":0}]
["Clase ","",null,null,null,{"$f":"'ANEXO I (b)'!$AA43","v":0},null,null,null,"",null,null,null,null,{"$f":"'DATOS PARA FORMALIZAR CTA'!O43","v":0}]
["Datos de telemedida","",null,null,null,{"$f":"'ANEXO I (b)'!$AA44","v":0},null,null,null,"",null,null,null,null,{"$f":"'DATOS PARA FORMALIZAR CTA'!O44","v":0}]
["·       Nº de teléfono: ","",null,null,null,{"$f":"'ANEXO I (b)'!$AA45","v":0},null,null,null,"",null,null,null,null,{"$f":"'DATOS PARA FORMALIZAR CTA'!O45","v":0}]
["·       Dirección de enlace: ","",null,null,null,{"$f":"'ANEXO I (b)'!$AA46","v":0},null,null,null,"",null,null,null,null,{"$f":"'DATOS PARA FORMALIZAR CTA'!O46","v":0}]
["·       Clave de acceso:  ","",null,null,null,{"$f":"'ANEXO I (b)'!$AA47","v":0},null,null,null,"",null,null,null,null,{"$f":"'DATOS PARA FORMALIZAR CTA'!O47","v":0},{"$f":"'DATOS PARA FORMALIZAR CTA'!P47","v":0}]
["Contador ubicado en consumo total (Indicar, en su caso)","",null,null,null,{"$f":"'ANEXO I (b)'!$AA48","v":0},null,null,null,""]
["Propiedad: Titular","",null,null,null,{"$f":"'ANEXO I (b)'!$AA49","v":0},null,null,null,""]
["Fabricante ","",null,null,null,{"$f":"'ANEXO I (b)'!$AA50","v":0},null,null,null,""]
["Modelo ","",null,null,null,{"$f":"'ANEXO I (b)'!$AA51","v":0},null,null,null,""]
["Número de fabricación ","",null,null,null,{"$f":"'ANEXO I (b)'!$AA52","v":1},null,null,null,""]
["Relación de intensidad ","",null,null,null,{"$f":"'ANEXO I (b)'!$AA53","v":1},null,null,null,""]
["Tensión ","",null,null,null,{"$f":"'ANEXO I (b)'!$AA54","v":1},null,null,null,""]
["Constante de lectura ","",null,null,null,{"$f":"'ANEXO I (b)'!$AA55","v":1},null,null,null,""]
["Clase ","",null,null,null,{"$f":"INSTRUCCIONES!L56","v":1},"COEFICIENTE RED",null,null,""]
["Datos de telemedida","",null,null,null,{"$f":"'DATOS PARA FORMALIZAR CTA'!C5","v":0},"UNIFILAR",null,null,""]
["·       Nº de teléfono: ","",null,null,null,{"$f":"'DATOS PARA FORMALIZAR CTA'!B12:C12","v":0},0,null,null,""]
["·       Dirección de enlace: ","",null,null,null,{"$f":"'DATOS PARA FORMALIZAR CTA'!B13","v":0},null,null,null,""]
["·       Clave de acceso:  ","",null,null,null,null,null,null,null,""]
["5. Acceso a la información",{"$f":"#REF!","v":{"$error":"#REF!"}},null,null,null,null,null,null,null,""]
["Lectura de contadores                In situ",null,null,null,null,null,null,null,null,""]
["Interlocutores a efectos de operación. ",null,null,null,null,null,null,null,null,""]
["Por el titular: ",null,null,null,null,null,null,null,null,""]
["Nombre",null,null,null,null,null,null,null,null,""]
["Teléfono",null,null,null,null,null,null,null,null,""]

{"sheet":"ANEXO I (b)","index":3,"n_rows":59,"n_cols":29,"rows_kept":59,"cut":false,"hidden":false,"merged":[[0,0,0,11],[1,0,1,10],[2,0,2,10],[3,0,3,10],[4,0,4,10],[40,0,41,5],[40,9,41,17],[9,0,9,5],[6,0,6,11],[5,0,5,10],[18,0,18,1],[10,0,10,12],[17,9,17,17],[17,0,17,5]]}
["I-B).- Aporte Esquema unifilar (identificando claramente los equipos de medida asociados)"]
["1. Instalaciones de Generación de Vertido Directo (Productores)",null,null,null,null,null,null,null,null,null,null,null,null,null,null,null,null,null,null,null,null,null,null,{"$f":"IF(Y2=FALSE,0,1)","v":0},false,{"$f":"INSTRUCCIONES!O2","v":0}]
["2.\tInstalación de generación para Autoconsumo Individual, con conexión en red interior. Equipo de Medida en Frontera (mide el consumo y la entrega de energía a la red).",null,null,null,null,null,null,null,null,null,null,null,null,null,null,null,null,null,null,null,null,null,null,{"$f":"IF(Y3=FALSE,0,1)","v":0},false,{"$f":"INSTRUCCIONES!O3","v":0}]
["3.\tInstalación de generación para Autoconsumo Colectivo, con conexión en red interior (Centralización de contadores / caja derivación) de varios consumidores asociados. Equipo de Medida de Generación Neta y los equipos de medida de los consumidores todos los consumidores conectados en RED INTERIOR",null,null,null,null,null,null,null,null,null,null,null,null,null,null,null,null,null,null,null,null,null,null,0,false,{"$f":"INSTRUCCIONES!O4","v":0}]
["4.\tInstalación de generación para Autoconsumo Colectivo, con conexión en red interior de uno (alguno) de los consumos asociados y a través de red de otro (/s) consumidor (/es) asociado (/s). Equipo de Medida de Generación Neta y los equipos de medida de los consumidores asociados.",null,null,null,null,null,null,null,null,null,null,null,null,null,null,null,null,null,null,null,null,null,null,0,false,{"$f":"INSTRUCCIONES!O5","v":0}]
["5- Otros ( adjuntelo conjuntamente con el formulario)",null,null,null,null,null,null,null,null,null,null,null,null,null,null,null,null,null,null,null,null,null,null,0,false,{"$f":"INSTRUCCIONES!O6","v":0}]
["*Si su esquema no se encuntra entre los expuestos, adjuntelo conjuntamente con el formulario.",null,null,null,null,null,null,null,null,null,null,null,null,null,null,null,null,null,null,null,null,null,null,{"$f":"SUM(X2:X6)","v":0},null,{"$f":"INSTRUCCIONES!O7","v":0}]
[null,null,null,null,null,null,null,null,null,null,null,null,null,null,null,null,null,null,null,null,null,null,null,0,null,{"$f":"INSTRUCCIONES!O8","v":0}]
[null,null,null,null,null,null,null,null,null,null,null,null,null,null,null,null,null,null,null,null,null,null,null,null,null,{"$f":"INSTRUCCIONES!O9","v":0}]
[null,null,null,null,null,null,null,null,null,null,null,null,null,null,null,null,null,null,null,null,null,null,null,null,null,{"$f":"INSTRUCCIONES!O10","v":0}]
[null,null,null,null,null,null,null,null,null,null,null,null,null,null,null,null,null,null,null,null,null,null,null,null,null,{"$f":"INSTRUCCIONES!O11","v":0}]
[null,null,null,null,null,null,null,null,null,null,null,null,null,null,null,null,null,null,null,null,null,null,null,null,null,{"$f":"INSTRUCCIONES!O12","v":0},{"$f":"IF('DATOS PARA FORMALIZAR CTA'!$B12:$C12=\"\",0,1)","v":0},0]
[null,null,null,null,null,null,null,null,null,null,null,null,null,null,null,null,null,null,null,null,null,null,null,null,null,{"$f":"INSTRUCCIONES!O13","v":0},{"$f":"IF('DATOS PARA FORMALIZAR CTA'!$B13:$C13=\"\",0,1)","v":0},0]
[null,null,null,null,null,null,null,null,null,null,null,null,null,null,null,null,null,null,null,null,null,null,null,null,null,{"$f":"INSTRUCCIONES!O14","v":0},{"$f":"IF('DATOS PARA FORMALIZAR CTA'!$B14:$C14=\"\",0,1)","v":0},0]
[null,null,null,null,null,null,null,null,null,null,null,null,null,null,null,null,null,null,null,null,null,null,null,null,null,{"$f":"INSTRUCCIONES!O15","v":0},{"$f":"IF('DATOS PARA FORMALIZAR CTA'!$B15:$C15=\"\",0,1)","v":0},0]
[null,null,null,null,null,null,null,null,null,null,null,null,null,null,null,null,null,null,null,null,null,null,null,null,null,{"$f":"INSTRUCCIONES!O16","v":0},{"$f":"IF('DATOS PARA FORMALIZAR CTA'!$B16:$C16=\"\",0,1)","v":0},0]
[null,null,null,null,null,null,null,null,null,null,null,null,null,null,null,null,null,null,null,null,null,null,null,null,null,{"$f":"INSTRUCCIONES!O17","v":0},{"$f":"IF('DATOS PARA FORMALIZAR CTA'!$B17:$C17=\"\",0,1)","v":0},0]
["1.       Instalaciones de Generación de Vertido Directo (Productores)",null,null,null,null,null,null,null,null,"2.\tInstalación de generación para Autoconsumo Individual, con conexión en red interior. Equipo de Medida en Frontera (mide el consumo y la entrega de energía a la red).",null,null,null,null,null,null,null,null,null,null,null,null,null,null,null,{"$f":"INSTRUCCIONES!O18","v":0},{"$f":"IF('DATOS PARA FORMALIZAR CTA'!$B18:$C18=\"\",0,1)","v":0},0]
[null,null,null,null,null,null,null,null,null,null,null,null,null,null,null,null,null,null,null,null,null,null,null,null,null,{"$f":"INSTRUCCIONES!O19","v":0},{"$f":"IF('DATOS PARA FORMALIZAR CTA'!$B19:$C19=\"\",0,1)","v":0},0]
[null,null,null,null,null,null,null,null,null,null,null,null,null,null,null,null,null,null,null,null,null,null,null,null,null,{"$f":"INSTRUCCIONES!O20","v":0},{"$f":"IF('DATOS PARA FORMALIZAR CTA'!$B20:$C20=\"\",0,1)","v":0},0]
[null,null,null,null,null,null,null,null,null,null,null,null,null,null,null,null,null,null,null,null,null,null,null,null,null,{"$f":"INSTRUCCIONES!O21","v":0},{"$f":"IF('DATOS PARA FORMALIZAR CTA'!$B21:$C21=\"\",0,1)","v":0},0]
[null,null,null,null,null,null,null,null,null,null,null,null,null,null,null,null,null,null,null,null,null,null,null,null,null,{"$f":"INSTRUCCIONES!O22","v":"VACIO"},{"$f":"IF('DATOS PARA FORMALIZAR CTA'!$B22:$C22=\"\",0,1)","v":0},0]
[null,null,null,null,null,null,null,null,null,null,null,null,null,null,null,null,null,null,null,null,null,null,null,null,null,{"$f":"INSTRUCCIONES!O23","v":""},{"$f":"IF('DATOS PARA FORMALIZAR CTA'!$B23:$C23=\"\",0,1)","v":0},0]
[null,null,null,null,null,null,null,null,null,null,null,null,null,null,null,null,null,null,null,null,null,null,null,null,null,{"$f":"INSTRUCCIONES!O24","v":""},{"$f":"IF('DATOS PARA FORMALIZAR CTA'!$B24:$C24=\"\",0,1)","v":0},0]
[null,null,null,null,null,null,null,null,null,null,null,null,null,null,null,null,null,null,null,null,null,null,null,null,null,null,{"$f":"IF('DATOS PARA FORMALIZAR CTA'!$B25:$C25=\"\",0,1)","v":0},0]
[null,null,null,null,null,null,null,null,null,null,null,null,null,null,null,null,null,null,null,null,null,null,null,null,null,null,{"$f":"IF('DATOS PARA FORMALIZAR CTA'!$B26:$C26=\"\",0,1)","v":0},0]
[null,null,null,null,null,null,null,null,null,null,null,null,null,null,null,null,null,null,null,null,null,null,null,null,null,null,{"$f":"IF('DATOS PARA FORMALIZAR CTA'!$B27:$C27=\"\",0,1)","v":0},0]
[null,null,null,null,null,null,null,null,null,null,null,null,null,null,null,null,null,null,null,null,null,null,null,null,null,null,{"$f":"IF('DATOS PARA FORMALIZAR CTA'!$B28:$C28=\"\",0,1)","v":0},0]
[null,null,null,null,null,null,null,null,null,null,null,null,null,null,null,null,null,null,null,null,null,{"$f":"'DATOS PARA FORMALIZAR CTA'!O29","v":0},null,null,null,null,{"$f":"IF('DATOS PARA FORMALIZAR CTA'!$B29:$C29=\"\",0,1)","v":0},0]
[null,null,null,null,null,null,null,null,null,null,null,null,null,null,null,null,null,null,null,null,null,{"$f":"'DATOS PARA FORMALIZAR CTA'!O30","v":0},null,null,null,null,{"$f":"IF('DATOS PARA FORMALIZAR CTA'!$B30:$C30=\"\",0,1)","v":0},0]
[null,null,null,null,null,null,null,null,null,null,null,null,null,null,null,null,null,null,null,null,null,{"$f":"'DATOS PARA FORMALIZAR CTA'!O31","v":0},null,null,null,null,{"$f":"IF('DATOS PARA FORMALIZAR CTA'!$B31:$C31=\"\",0,1)","v":0},0]
[null,null,null,null,null,null,null,null,null,null,null,null,null,null,null,null,null,null,null,null,null,{"$f":"'DATOS PARA FORMALIZAR CTA'!O32","v":0},null,null,null,null,{"$f":"IF('DATOS PARA FORMALIZAR CTA'!$B32:$C32=\"\",0,1)","v":0},0]
[null,null,null,null,null,null,null,null,null,null,null,null,null,null,null,null,null,null,null,null,null,{"$f":"'DATOS PARA FORMALIZAR CTA'!O33","v":0},null,null,null,null,{"$f":"IF('DATOS PARA FORMALIZAR CTA'!$B33:$C33=\"\",0,1)","v":0},0]
[null,null,null,null,null,null,null,null,null,null,null,null,null,null,null,null,null,null,null,null,null,{"$f":"'DATOS PARA FORMALIZAR CTA'!O34","v":0},null,null,null,null,{"$f":"IF('DATOS PARA FORMALIZAR CTA'!$B34:$C34=\"\",0,1)","v":0},0]
[null,null,null,null,null,null,null,null,null,null,null,null,null,null,null,null,null,null,null,null,null,{"$f":"'DATOS PARA FORMALIZAR CTA'!O35","v":0},{"$f":"'DATOS PARA FORMALIZAR CTA'!P35","v":0},null,null,null,{"$f":"IF('DATOS PARA FORMALIZAR CTA'!$B35:$C35=\"\",0,1)","v":0},0]
[null,null,null,null,null,null,null,null,null,null,null,null,null,null,null,null,null,null,null,null,null,{"$f":"'DATOS PARA FORMALIZAR CTA'!O36","v":0},null,null,null,null,{"$f":"IF('DATOS PARA FORMALIZAR CTA'!$B36:$C36=\"\",0,1)","v":0},0]
[null,null,null,null,null,null,null,null,null,null,null,null,null,null,null,null,null,null,null,null,null,{"$f":"'DATOS PARA FORMALIZAR CTA'!O37","v":0},null,null,null,null,{"$f":"IF('DATOS PARA FORMALIZAR CTA'!$B37:$C37=\"\",0,1)","v":0},0]
[null,null,null,null,null,null,null,null,null,null,null,null,null,null,null,null,null,null,null,null,null,{"$f":"'DATOS PARA FORMALIZAR CTA'!O38","v":0},null,null,null,null,{"$f":"IF('DATOS PARA FORMALIZAR CTA'!$B38:$C38=\"\",0,1)","v":0},0]
[null,null,null,null,null,null,null,null,null,null,null,null,null,null,null,null,null,null,null,null,null,{"$f":"'DATOS PARA FORMALIZAR CTA'!O39","v":0},null,null,null,null,{"$f":"IF('DATOS PARA FORMALIZAR CTA'!$B39:$C39=\"\",0,1)","v":0},0]
[null,null,null,null,null,null,null,null,null,null,null,null,null,null,null,null,null,null,null,null,null,{"$f":"'DATOS PARA FORMALIZAR CTA'!O40","v":0},null,null,null,null,{"$f":"IF('DATOS PARA FORMALIZAR CTA'!$B40:$C40=\"\",0,1)","v":0},0]
["3.\tInstalación de generación para Autoconsumo Colectivo, con conexión en red interior (Centralización de contadores / caja derivación) de varios consumidores asociados. Equipo de Medida de Generación Neta y los equipos de medida de los consumidores asociados.\ntodos los consumidores conectados en RED INTERIOR",null,null,null,null,null,null,null,null,"4.\tInstalación de generación para Autoconsumo Colectivo, con conexión en red interior de uno (alguno) de los consumos asociados y a través de red de otro (/s) consumidor (/es) asociado (/s). Equipo de Medida de Generación Neta y los equipos de medida de los consumidores asociados.",null,null,null,null,null,null,null,null,null,null,null,{"$f":"'DATOS PARA FORMALIZAR CTA'!O41","v":0},null,null,null,null,{"$f":"IF('DATOS PARA FORMALIZAR CTA'!$B41:$C41=\"\",0,1)","v":0},0]
[null,null,null,null,null,null,null,null,null,null,null,null,null,null,null,null,null,null,null,null,null,{"$f":"'DATOS PARA FORMALIZAR CTA'!O42","v":0},null,null,null,null,{"$f":"IF('DATOS PARA FORMALIZAR CTA'!$B42:$C42=\"\",0,1)","v":0},0]
[null,null,null,null,null,null,null,null,null,null,null,null,null,null,null,null,null,null,null,null,null,{"$f":"'DATOS PARA FORMALIZAR CTA'!O43","v":0},null,null,null,null,{"$f":"IF('DATOS PARA FORMALIZAR CTA'!$B43:$C43=\"\",0,1)","v":0},0]
[null,null,null,null,null,null,null,null,null,null,null,null,null,null,null,null,null,null,null,null,null,{"$f":"'DATOS PARA FORMALIZAR CTA'!O44","v":0},null,null,null,null,{"$f":"IF('DATOS PARA FORMALIZAR CTA'!$B44:$C44=\"\",0,1)","v":0},0]
[null,null,null,null,null,null,null,null,null,null,null,null,null,null,null,null,null,null,null,null,null,{"$f":"'DATOS PARA FORMALIZAR CTA'!O45","v":0},null,null,null,null,{"$f":"IF('DATOS PARA FORMALIZAR CTA'!$B45:$C45=\"\",0,1)","v":0},0]
[null,null,null,null,null,null,null,null,null,null,null,null,null,null,null,null,null,null,null,null,null,{"$f":"'DATOS PARA FORMALIZAR CTA'!O46","v":0},null,null,null,null,{"$f":"IF('DATOS PARA FORMALIZAR CTA'!$B46:$C46=\"\",0,1)","v":0},0]
[null,null,null,null,null,null,null,null,null,null,null,null,null,null,null,null,null,null,null,null,null,{"$f":"'DATOS PARA FORMALIZAR CTA'!O47","v":0},{"$f":"'DATOS PARA FORMALIZAR CTA'!P47","v":0},null,null,null,{"$f":"IF('DATOS PARA FORMALIZAR CTA'!$B47:$C47=\"\",0,1)","v":0},0]
[null,null,null,null,null,null,null,null,null,null,null,null,null,null,null,null,null,null,null,null,null,null,null,null,null,null,{"$f":"IF('DATOS PARA FORMALIZAR CTA'!$B48:$C48=\"\",0,1)","v":0},0]
[null,null,null,null,null,null,null,null,null,null,null,null,null,null,null,null,null,null,null,null,null,null,null,null,null,null,{"$f":"IF('DATOS PARA FORMALIZAR CTA'!$B49:$C49=\"\",0,1)","v":0},0]
[null,null,null,null,null,null,null,null,null,null,null,null,null,null,null,null,null,null,null,null,null,null,null,null,null,null,{"$f":"IF('DATOS PARA FORMALIZAR CTA'!$B50:$C50=\"\",0,1)","v":0},0]
[null,null,null,null,null,null,null,null,null,null,null,null,null,null,null,null,null,null,null,null,null,null,null,null,null,null,{"$f":"IF('DATOS PARA FORMALIZAR CTA'!$B51:$C51=\"\",0,1)","v":0},0]
[null,null,null,null,null,null,null,null,null,null,null,null,null,null,null,null,null,null,null,null,null,null,null,null,null,null,{"$f":"IF('DATOS PARA FORMALIZAR CTA'!$B52:$C52=\"\",0,1)","v":1},1]
[null,null,null,null,null,null,null,null,null,null,null,null,null,null,null,null,null,null,null,null,null,null,null,null,null,null,{"$f":"IF('DATOS PARA FORMALIZAR CTA'!$B53:$C53=\"\",0,1)","v":1},1]
[null,null,null,null,null,null,null,null,null,null,null,null,null,null,null,null,null,null,null,null,null,null,null,null,null,null,{"$f":"IF('DATOS PARA FORMALIZAR CTA'!$B54:$C54=\"\",0,1)","v":1},1]
[null,null,null,null,null,null,null,null,null,null,null,null,null,null,null,null,null,null,null,null,null,null,null,null,null,null,{"$f":"IF('DATOS PARA FORMALIZAR CTA'!$B55:$C55=\"\",0,1)","v":1},1]
[null,null,null,null,null,null,null,null,null,null,null,null,null,null,null,null,null,null,null,null,null,null,null,null,null,null,{"$f":"IF('DATOS PARA FORMALIZAR CTA'!$B84:$C84=\"\",0,1)","v":1},0,"COEF REDUC"]
[null,null,null,null,null,null,null,null,null,null,null,null,null,null,null,null,null,null,null,null,null,null,null,null,null,null,{"$f":"'DATOS PARA FORMALIZAR CTA'!C5","v":0},null,"UNIFILAR"]
[null,null,null,null,null,null,null,null,null,null,null,null,null,null,null,null,null,null,null,null,null,null,null,null,null,null,{"$f":"'DATOS PARA FORMALIZAR CTA'!B12:C12","v":0},0,"EXP"]
[null,null,null,null,null,null,null,null,null,null,null,null,null,null,null,null,null,null,null,null,null,null,null,null,null,null,{"$f":"'DATOS PARA FORMALIZAR CTA'!B13:C13","v":0},0,"UNIC"]

{"sheet":"ANEXO II","index":4,"n_rows":68,"n_cols":26,"rows_kept":68,"cut":false,"hidden":true,"merged":[[25,1,25,2],[26,1,26,2],[0,0,0,2],[19,1,19,2],[20,1,20,2],[21,1,21,2],[22,1,22,2],[23,1,23,2],[24,1,24,2],[13,1,13,2],[14,1,14,2],[15,1,15,2],[16,1,16,2],[17,1,17,2],[18,1,18,2],[7,1,7,2],[8,1,8,2],[9,1,9,2],[10,1,10,2],[11,1,11,2],[12,1,12,2],[6,1,6,2],[1,0,1,2],[2,0,2,2],[3,1,3,2],[4,1,4,2],[5,1,5,2]]}
["ANEXO II"]
["A cumplimentar solo por los contratos en Media tensión:",null,null,"A cumplimentar solo por los contratos en Media tensión:",null,null,null,null,null,null,null,null,null,null,null,null,null,null,null,null,null,null,null,null,null,{"$f":"INSTRUCCIONES!O2","v":0}]
["La especificación de varios tramos es para casos donde haya 2 tipos de cable distintos.",null,null,null,"tipo de cable","resistencia electrica",null,"tipo de cable","resistencia conductor",null,null,null,null,null,null,null,null,null,null,null,null,null,null,null,null,{"$f":"INSTRUCCIONES!O3","v":0}]
["Total Potencia nominal inversores (kW)",null,null,null,"LA-30",1.075,null,"AL 3x 1x 16 Mm2",1.91,null,null,null,null,null,null,null,null,null,null,null,null,null,null,null,null,{"$f":"INSTRUCCIONES!O4","v":0}]
["Tensión de conexión a la red de Endesa (Conforme condiciones conexión Endesa) (kV)",null,null,null,"LA-40",0.77800000000000002,null,"AL 3x 1x 25 Mm2",1.2,null,null,null,null,null,null,null,null,null,null,null,null,null,null,null,null,{"$f":"INSTRUCCIONES!O5","v":0}]
["Tensión de Baja ",0.4,null,null,"LA-56",0.61360000000000003,null,"AL 3x 1x 35 Mm2",0.86799999999999999,null,null,null,null,null,null,null,null,null,null,null,null,null,null,null,null,{"$f":"INSTRUCCIONES!O6","v":0}]
["Distancia del equipo de baja tensión al transformador 1er Tramo",null,null,null,"CF-LA56-OL",0.61360000000000003,null,"AL 3x 1x 50 Mm2",0.64100000000000001,null,null,null,null,null,null,null,null,null,null,null,null,null,null,null,null,{"$f":"INSTRUCCIONES!O7","v":0}]
["Tipo de cable del equipo de baja tensión al transformador 1er Tramo","tipo de cable",null,"desplegable","LA-78",0.42609999999999998,null,"AL 3x 1x 70 Mm2",0.443,null,null,null,null,null,null,null,null,null,null,null,null,null,null,null,null,{"$f":"INSTRUCCIONES!O8","v":0}]
["Resistencia Baja Tensión 1er Tramo",{"$f":"IF(ISERROR(VLOOKUP($B$8,$H:$I,2,FALSE)),0,(VLOOKUP($B$8,$H:$I,2,FALSE)))","v":"resistencia conductor"},null,"No tocar","95",0.35199999999999998,null,"AL 3x 1x 95 Mm2",0.32,null,null,null,null,null,null,null,null,null,null,null,null,null,null,null,null,{"$f":"INSTRUCCIONES!O9","v":0}]
["Perdidas Baja Tensión 1er Tramo (%)",{"$f":"B9*(B7/1000)*($B$4)/($B$6^2)/1000*100","v":{"$error":"#VALUE!"}},null,"No tocar","LA-110",0.307,null,"AL 3x 1x120 Mm2",0.253,null,null,null,null,null,null,null,null,null,null,null,null,null,null,null,null,{"$f":"INSTRUCCIONES!O10","v":0}]
["Distancia (m) del equipo de baja tensión al transformador 2º Tramo",null,null,null,"PENGUIN",0.26769999999999999,null,"AL 3x 1x150 Mm2",0.20599999999999999,null,null,null,null,null,null,null,null,null,null,null,null,null,null,null,null,{"$f":"INSTRUCCIONES!O11","v":0}]
["Tipo de cable del equipo de baja tensión al transformador 2º Tramo","tipo de cable",null,"desplegable","SPARVIERO",0.25700000000000001,null,"AL 3x 1x185 Mm2",0.16400000000000001,null,{"$f":"'ANEXO I (b)'!AA12","v":0},null,null,null,null,null,null,null,null,null,null,null,null,null,null,{"$f":"INSTRUCCIONES!O12","v":0}]
["Resistencia Baja Tensión 2º Tramo",{"$f":"IF(ISERROR(VLOOKUP($B$12,$H:$I,2,FALSE)),0,(VLOOKUP($B$12,$H:$I,2,FALSE)))","v":"resistencia conductor"},null,"No tocar","LA-145",0.24199999999999999,null,"AL 3x 1x240 Mm2",0.125,null,{"$f":"'ANEXO I (b)'!AA13","v":0},null,null,null,null,null,null,null,null,null,null,null,null,null,null,{"$f":"INSTRUCCIONES!O13","v":0}]
["Perdidas Baja Tensión 2º Tramo (%)",{"$f":"B13*(B11/1000)*($B$4)/($B$6^2)/1000*100","v":{"$error":"#VALUE!"}},null,"No tocar","LA-180",0.19600000000000001,null,"AL 3x 1x300 Mm2",0.1,null,{"$f":"'ANEXO I (b)'!AA14","v":0},null,null,null,null,null,null,null,null,null,null,null,null,null,null,{"$f":"INSTRUCCIONES!O14","v":0}]
["Total perdidas Baja Tensión (%)",{"$f":"SUM(B10+B14)","v":{"$error":"#VALUE!"}},null,"No tocar","PIPER",0.19,null,"Cu 1x 1,5 Mm2",12.1,null,{"$f":"'ANEXO I (b)'!AA15","v":0},null,null,null,null,null,null,null,null,null,null,null,null,null,null,{"$f":"INSTRUCCIONES!O15","v":0}]
["Perdidas Transformador (%)",{"$f":"IF(B5<1,0,2.5)","v":0},null,null,"250 UNE",0.124,null,"Cu 1x 2,5 Mm2",7.41,null,{"$f":"'ANEXO I (b)'!AA16","v":0},null,null,null,null,null,null,null,null,null,null,null,null,null,null,{"$f":"INSTRUCCIONES!O16","v":0}]
["Distancia (m) del transformador al pto de conexión con Endesa (MT) 1er Tramo",0,null,null,"LA-280 HAWK",0.11899999999999999,null,"Cu 1x 4 Mm2",4.6100000000000003,null,{"$f":"'ANEXO I (b)'!AA17","v":0},null,null,null,null,null,null,null,null,null,null,null,null,null,null,{"$f":"INSTRUCCIONES!O17","v":0}]
["Tipo de cable del transformador al punto de conexión con Endesa (MT) 1er Tramo","tipo de cable",null,null,"LA-380 GULL",8.5699999999999998E-2,null,"Cu 1x 6 Mm2",3.08,null,{"$f":"'ANEXO I (b)'!AA18","v":0},null,null,null,null,null,null,null,null,null,null,null,null,null,null,{"$f":"INSTRUCCIONES!O18","v":0}]
["Resistencia Media Tensión 1er Tramo",{"$f":"IF(ISERROR(VLOOKUP($B$18,$E:$F,2,FALSE)),0,(VLOOKUP($B$18,$E:$F,2,FALSE)))","v":"resistencia electrica"},null,"No tocar","LA-455 CONDOR",7.1800000000000003E-2,null,"Cu 1x10 Mm2",1.83,null,{"$f":"'ANEXO I (b)'!AA19","v":0},null,null,null,null,null,null,null,null,null,null,null,null,null,null,{"$f":"INSTRUCCIONES!O19","v":0}]
["Perdidas Media Tensión 1er Tramo (%)",{"$f":"IF(ISERROR(B19*(B17/1000)*($B$46)/($B$47^2)/1000*100),0,(B19*(B17/1000)*($B$46)/($B$47^2)/1000*100))","v":0},null,"No tocar","RAIL",5.9799999999999999E-2,null,"Cu 1x16 Mm2",1.1499999999999999,null,{"$f":"'ANEXO I (b)'!AA20","v":0},null,null,null,null,null,null,null,null,null,null,null,null,null,null,{"$f":"INSTRUCCIONES!O20","v":0}]
["Distancia (m) del transformador al punto de conexión con Endesa (MT) 2º Tramo",null,null,null,"LA-545 CARDINAL",5.96E-2,null,"Cu 1x 25 Mm2",0.72699999999999998,null,{"$f":"'ANEXO I (b)'!AA21","v":0},null,null,null,null,null,null,null,null,null,null,null,null,null,null,{"$f":"INSTRUCCIONES!O21","v":0}]
["Tipo de cable del transformador al punto de conexión con Endesa (MT) 2º Tramo","tipo de cable",null,null,"LA-635 FINCH",5.11E-2,null,"Cu 1x 35 Mm2",0.52400000000000002,null,{"$f":"'ANEXO I (b)'!AA22","v":0},null,null,null,null,null,null,null,null,null,null,null,null,null,null,{"$f":"INSTRUCCIONES!O22","v":"VACIO"}]
["Resistencia Media Tensión 2º Tramo",{"$f":"IF(ISERROR(VLOOKUP($B$22,$E:$F,2,FALSE)),0,(VLOOKUP($B$22,$E:$F,2,FALSE)))","v":"resistencia electrica"},null,"No tocar","C50",0.35899999999999999,null,"Cu 1x 50 Mm2",0.38700000000000001,null,{"$f":"'ANEXO I (b)'!AA23","v":0},null,null,null,null,null,null,null,null,null,null,null,null,null,null,{"$f":"INSTRUCCIONES!O23","v":""}]
["Perdidas Media Tensión 2º Tramo (%)",{"$f":"IF(ISERROR(B23*(B21/1000)*($B$4)/($B$5^2)/1000*100),0,(B23*(B21/1000)*($B$4)/($B$5^2)/1000*100))","v":0},null,"No tocar","C95",0.189,null,"Cu 1x 70 Mm2",0.26800000000000002,null,{"$f":"'ANEXO I (b)'!AA24","v":0},null,null,null,null,null,null,null,null,null,null,null,null,null,null,{"$f":"INSTRUCCIONES!O24","v":""}]
["Total perdidas Media Tensión (%)",{"$f":"SUM(B20+B24)","v":0},null,"No tocar","AL 1x 95 Mm2",0.32,null,"Cu 1x 95 Mm2",0.193,null,{"$f":"'ANEXO I (b)'!AA25","v":0}]
["TOTAL PERDIDAS (%)",{"$f":"IF(B5<1,0,SUM(B10+B14+B16+B20+B24))","v":0},null,"No tocar","AL 1x150 Mm2",0.20599999999999999,null,"Cu 1x 120 Mm2",0.153,null,{"$f":"'ANEXO I (b)'!AA26","v":0}]
["COEFICIENTE REDUCTOR",{"$f":"(1-(B26/100))","v":1},null,"No tocar","AL 1x240 Mm2",0.125,null,"Cu 1x 150 Mm2",0.124,null,{"$f":"'ANEXO I (b)'!AA27","v":0}]
[null,null,null,null,"AL 1x400 Mm2",0.10199999999999999,null,"Cu 1x 185 Mm2",9.9099999999999994E-2,null,{"$f":"'ANEXO I (b)'!AA28","v":0}]
[null,null,null,null,null,null,null,"Cu 1x 240 Mm2",7.5399999999999995E-2,null,{"$f":"'ANEXO I (b)'!AA29","v":0},null,null,null,{"$f":"'DATOS PARA FORMALIZAR CTA'!O29","v":0}]
[null,null,null,null,null,null,null,"Cu 1x 300 Mm2",6.0100000000000001E-2,null,{"$f":"'ANEXO I (b)'!AA30","v":0},null,null,null,{"$f":"'DATOS PARA FORMALIZAR CTA'!O30","v":0}]
[null,null,null,null,null,null,null,"Cu 1x 400 Mm2",4.7E-2,null,{"$f":"'ANEXO I (b)'!AA31","v":0},null,null,null,{"$f":"'DATOS PARA FORMALIZAR CTA'!O31","v":0}]
[null,null,null,null,null,null,null,"Cu 2x 1,5 Mm2",12.1,null,{"$f":"'ANEXO I (b)'!AA32","v":0},null,null,null,{"$f":"'DATOS PARA FORMALIZAR CTA'!O32","v":0}]
[null,null,null,null,null,null,null,"Cu 2x 2,5 Mm2",7.41,null,{"$f":"'ANEXO I (b)'!AA33","v":0},null,null,null,{"$f":"'DATOS PARA FORMALIZAR CTA'!O33","v":0}]
[null,null,null,null,null,null,null,"Cu 2x 4 Mm2",4.6100000000000003,null,{"$f":"'ANEXO I (b)'!AA34","v":0},null,null,null,{"$f":"'DATOS PARA FORMALIZAR CTA'!O34","v":0}]
[null,null,null,null,null,null,null,"Cu 2x 6 Mm2",3.08,null,{"$f":"'ANEXO I (b)'!AA35","v":0},null,null,null,{"$f":"'DATOS PARA FORMALIZAR CTA'!O35","v":0},{"$f":"'DATOS PARA FORMALIZAR CTA'!P35","v":0}]
[null,null,null,null,null,null,null,"Cu 2x 10 Mm2",1.83,null,{"$f":"'ANEXO I (b)'!AA36","v":0},null,null,null,{"$f":"'DATOS PARA FORMALIZAR CTA'!O36","v":0}]
[null,null,null,null,null,null,null,"Cu 2x 16 Mm2",1.1499999999999999,null,{"$f":"'ANEXO I (b)'!AA37","v":0},null,null,null,{"$f":"'DATOS PARA FORMALIZAR CTA'!O37","v":0}]
[null,null,null,null,null,null,null,"Cu 2x 25 Mm2",0.72699999999999998,null,{"$f":"'ANEXO I (b)'!AA38","v":0},null,null,null,{"$f":"'DATOS PARA FORMALIZAR CTA'!O38","v":0}]
[null,null,null,null,null,null,null,"Cu 2x 35 Mm2",0.52400000000000002,null,{"$f":"'ANEXO I (b)'!AA39","v":0},null,null,null,{"$f":"'DATOS PARA FORMALIZAR CTA'!O39","v":0}]
[null,null,null,null,null,null,null,"Cu 2x 50 Mm2",0.38700000000000001,null,{"$f":"'ANEXO I (b)'!AA40","v":0},null,null,null,{"$f":"'DATOS PARA FORMALIZAR CTA'!O40","v":0}]
[null,null,null,null,null,null,null,"Cu 3x 15 Mm2",12.1,null,{"$f":"'ANEXO I (b)'!AA41","v":0},null,null,null,{"$f":"'DATOS PARA FORMALIZAR CTA'!O41","v":0}]
[null,null,null,null,null,null,null,"Cu 3x 2,5 Mm2",7.41,null,{"$f":"'ANEXO I (b)'!AA42","v":0},null,null,null,{"$f":"'DATOS PARA FORMALIZAR CTA'!O42","v":0}]
[null,null,null,null,null,null,null,"Cu 3x 4 Mm2",4.6100000000000003,null,{"$f":"'ANEXO I (b)'!AA43","v":0},null,null,null,{"$f":"'DATOS PARA FORMALIZAR CTA'!O43","v":0}]
[null,null,null,null,null,null,null,"Cu 3x 6 Mm2",3.08,null,{"$f":"'ANEXO I (b)'!AA44","v":0},null,null,null,{"$f":"'DATOS PARA FORMALIZAR CTA'!O44","v":0}]
[null,null,null,null,null,null,null,"Cu 3x 10 Mm2",1.83,null,{"$f":"'ANEXO I (b)'!AA45","v":0},null,null,null,{"$f":"'DATOS PARA FORMALIZAR CTA'!O45","v":0}]
[null,null,null,null,null,null,null,"Cu 3x 16 Mm2",1.1499999999999999,null,{"$f":"'ANEXO I (b)'!AA46","v":0},null,null,null,{"$f":"'DATOS PARA FORMALIZAR CTA'!O46","v":0}]
[null,null,null,null,null,null,null,"Cu 3x 25 Mm2",0.72699999999999998,null,{"$f":"'ANEXO I (b)'!AA47","v":0},null,null,null,{"$f":"'DATOS PARA FORMALIZAR CTA'!O47","v":0},{"$f":"'DATOS PARA FORMALIZAR CTA'!P47","v":0}]
[null,null,null,null,null,null,null,"Cu 3x 35 Mm2",0.52400000000000002,null,{"$f":"'ANEXO I (b)'!AA48","v":0}]
[null,null,null,null,null,null,null,"Cu 3x 50 Mm2",0.38700000000000001,null,{"$f":"'ANEXO I (b)'!AA49","v":0}]
[null,null,null,null,null,null,null,"Cu 3x 70 Mm2",0.26800000000000002,null,{"$f":"'ANEXO I (b)'!AA50","v":0}]
[null,null,null,null,null,null,null,"Cu 3x 95 Mm2",0.193,null,{"$f":"'ANEXO I (b)'!AA51","v":0}]
[null,null,null,null,null,null,null,"Cu 3x 120 Mm2",0.153,null,{"$f":"'ANEXO I (b)'!AA52","v":1}]
[null,null,null,null,null,null,null,"Cu 3x 150 Mm2",0.124,null,{"$f":"'ANEXO I (b)'!AA53","v":1}]
[null,null,null,null,null,null,null,"Cu 3x 185 Mm2",9.9099999999999994E-2,null,{"$f":"'ANEXO I (b)'!AA54","v":1}]
[null,null,null,null,null,null,null,"Cu 3x 240 Mm2",7.5399999999999995E-2,null,{"$f":"'ANEXO I (b)'!AA55","v":1}]
[null,null,null,null,null,null,null,"Cu 3x 300 Mm2",6.0100000000000001E-2,null,{"$f":"'ANEXO I (b)'!AA56","v":1}]
[null,null,null,null,null,null,null,"Cu 3x 400 Mm2",4.7E-2,null,{"$f":"'ANEXO I (b)'!AA57","v":0}]
[null,null,null,null,null,null,null,"Cu 4x 1,5 Mm2",12.1,null,{"$f":"'ANEXO I (b)'!AA58","v":0}]
[null,null,null,null,null,null,null,"Cu 4x 2,5 Mm2",7.41,null,{"$f":"'ANEXO I (b)'!AA59","v":0}]
[null,null,null,null,null,null,null,"Cu 4x 4 Mm2",4.6100000000000003]
[null,null,null,null,null,null,null,"Cu 4x 6 Mm2",3.08]
[null,null,null,null,null,null,null,"Cu 4x 10 Mm2",1.83]
[null,null,null,null,null,null,null,"Cu 4x 16 Mm2",1.1499999999999999]
[null,null,null,null,null,null,null,"Cu 4x 25 Mm2",0.72699999999999998]
[null,null,null,null,null,null,null,"Cu 4x 35 Mm2",0.52400000000000002]
[null,null,null,null,null,null,null,"Cu 4x 50 Mm2",0.38700000000000001]
[null,null,null,null,null,null,null,"Cu 4x70 Mm2",0.26800000000000002]
[null,null,null,null,null,null,null,"Cu 4x 95 Mm2",0.193]

{"sheet":"DATOS","index":5,"n_rows":68,"n_cols":26,"rows_kept":68,"cut":false,"hidden":true,"merged":[]}
[]
[null,null,null,"-",null,null,null,null,null,null,null,null,null,null,null,null,null,null,null,"Geo Point","Geo Shape","CCAA","Cod_CCAA","Provincia","Texto","Codigo"]
["COGENERACIÓN",null,null,"Con Excedentes (S2) acogido a compensación (a0)",null,null,null,null,null,null,null,null,"tipo de cable","resistencia electrica",null,"tipo de cable","resistencia conductor",null,null,"43.1257958229, -8.4642836868",{"$cut":{"chars":32767,"head":"{\"coordinates\": [[[[-9.015034632124795, 42.4853892868927], [-9.012050540138365, 42.48230585792262], [-9.01092430160381, 42.48248213696458], [-9.010724576471773, 42.48053031926211], [-9.008233735034969, 42.48067941381538], [-9.007529241154643, 42.47549555791761], [-9.005022522894063, 42.471675675020954], [-9.001747767521982, 42.47112773072631], [-8.999808165582305, 42.46915926667177], [-9.001706656123462, 42.46752918880758], [-9.003710006109191, 42.468387059960556], [-9.005924098166389, 42.466119253662534], [-9.007210291618852, 42.466978751743845], [-9.01020505020195, 42.46334654362151], [-9.01188623647874, 42.46376214715403], [-9.01210564729191, 42.465793967842956], [-9.013504495769737, 42.46377596227616], [-9.016044144472353, 42.465406493066276], [-9.018904737870047, 42.46885641102183], [-9.017265558612214, 42.471535273648236], [-9.018929990410701, 42.47101545677591], [-9.020501676545248, 42.47458727665838], [-9.018566612893094, 42.48114341769021], [-9.019778810318838, 42.482240710791274], [-9.015034632124795, 42.4853892868927]]], [[[-9.005352934031727, 42.50070656698907], [-9.002429498988214, 42.498132789664034], [-9.003169028962423, 42.49569947377056], [-9.005758737182703, 42.49619337921728], [-9.008152315327923, 42.50059529320207], [-9.005352934031727, 42.50070656698907]]], [[[-9.048123725315543, 42.51125832119697], [-9.04701259824071, 42.51096610810248], [-9.048228881204745, 42.509830470774304], [-9.046981018865504, 42.50875337514173], [-9.048380100905057, 42.50938141978972], [-9.049680721301481, 42.507107112698925], [-9.051394916173189, 42.50923067984906], [-9.049467225893583, 42.510557014229434], [-9.049740854525911, 42.51225282995806], [-9.048123725315543, 42.51125832119697]]], [[[-9.04372145218508, 42.662588472819564], [-9.04317727075172, 42.66100601372375], [-9.044768144901143, 42.661812918845406], [-9.04372145218508, 42.662588472819564]]], [[[-8.834246154801777, 43.356245328926846], [-8.832135309714717, 43.35546213416663], [-8.832059995859911, 43.352495391648326], [-8.835725603719775, 43.35354098888491], [-8.835501131797725, 43.356082035674966], [-8.834246154801777, 43.356245328926846]]], [[[-8.833840088444456, 43.362288428627274], [-8.831896666868671, 43.36145167798856], [-8.830598838437512, 43.3575752247783], [-8.832322661452194, 43.35612774813674], [-8.836191595790394, 43.35684783602927], [-8.833840088444456, 43.362288428627274]]], [[[-8.838519713699837, 43.36296699102441], [-8.836581615540439, 43.36205801477787], [-8.836091610604141, 43.35734807381415], [-8.83734941459814, 43.358624953114], [-8.840258431680983, 43.35616239464074], [-8.845512651732255, 43.35474074110552], [-8.846940854457806, 43.35535163814337], [-8.847291886426408, 43.35912346112032], [-8.850005347457616, 43.361675753136794], [-8.84561051869006, 43.36280147705645], [-8.843881378547469, 43.36111679907606], [-8.844167705764752, 43.3619122697292], [-8.841531832224259, 43.36298364617272], [-8.838519713699837, 43.36296699102441]]], [[[-8.211224205461605, 43.596212375125596], [-8.210674820986393, 43.59558931499463], [-8.212067155778518, 43.59636286673639], [-8.211224205461605, 43.596212375125596]]], [[[-8.191551306443003, 43.6123463979318], [-8.191459004547413, 43.61357493981166], [-8.19088878993743, 43.61270963871942], [-8.191551306443003, 43.6123463979318]]], [[[-8.153693211943793, 43.61776456187305], [-8.154105979732224, 43.61752083510472], [-8.154357311280815, 43.61799558521303], [-8.153693211943793, 43.61776456187305]]], [[[-8.09732854697524, 43.65582328167736], [-8.097804787026684, 43.65646813822304], [-8.097194980967123, 43.65644142374966], [-8.09732854697524, 43.65582328167736]]], [[[-8.090607888310348, 43.665774373712075], [-8.091907932885011, 43.66648152389021], [-8.090740166134273, 43.66616455219886], [-8.090607888310348, 43.665774373712075]]], [[[-7.809923186207562, 43.69426385901818], [-7.81068628438037, 43.694186690792236], [-7.810875500121981, 43.694844910636675], [-7.809923186207562, 43.69426385901818]]], [[[-7.809131606050251, 43.695224526886825], [-7.808096331821, 43.69469196683115], [-7.809433305238548, 43.694653634041806], [-"}},"Galicia","12","A Coruña","La Coruña","15"]
["RESIDUOS",null,null,"Con Excedentes (S2) no acogido a compensación que disponga de un único contrato de acceso (b1)",null,null,null,null,null,null,null,null,"LA-30",1.075,null,"AL 3x 1x 16 Mm2",1.91,null,null,"38.4786378049, -0.568699068376",{"$cut":{"chars":31261,"head":"{\"coordinates\": [[[[-0.485462499104892, 38.16506930011457], [-0.485449609178904, 38.16498613067568], [-0.485593576779552, 38.16498777985484], [-0.485462499104892, 38.16506930011457]]], [[[-0.4845543930825, 38.16589810484623], [-0.484687485678352, 38.16578119600469], [-0.484792747568391, 38.16579382356419], [-0.4845543930825, 38.16589810484623]]], [[[-0.477074365154974, 38.16615379814132], [-0.477223189946434, 38.16614079773074], [-0.477062853244633, 38.16629907388172], [-0.477074365154974, 38.16615379814132]]], [[[-0.480697691107435, 38.16729943759608], [-0.480786872255594, 38.16730135298459], [-0.480717204312045, 38.16731661182054], [-0.480697691107435, 38.16729943759608]]], [[[-0.477827036582104, 38.16664342820484], [-0.47759583088922, 38.16609023898693], [-0.476345911409631, 38.16574266918624], [-0.472031377660075, 38.166664699658355], [-0.464762795184146, 38.162872057767906], [-0.466641966553974, 38.163354182102026], [-0.471107712816946, 38.162021496615395], [-0.472572116748743, 38.16315197520734], [-0.475905851904783, 38.162828557713645], [-0.478210062049572, 38.1654651425704], [-0.48133579499648, 38.16488705272233], [-0.487511339774, 38.16705589186761], [-0.480860323004804, 38.167343050103604], [-0.480443449915712, 38.16697996887912], [-0.47946654372236, 38.1670315058917], [-0.479451693672332, 38.16644919789313], [-0.47807920176721, 38.16636824490138], [-0.478686716224194, 38.1676350408585], [-0.477827036582104, 38.16664342820484]]], [[[-0.380992498233928, 38.431339021577756], [-0.382864062669968, 38.4318494038546], [-0.382824641900341, 38.43262339081281], [-0.380992498233928, 38.431339021577756]]], [[[-0.128215910774145, 38.50177606167067], [-0.129410321555746, 38.501147681209204], [-0.13240064874492, 38.50206790858455], [-0.1307166031329, 38.50405380692582], [-0.128215910774145, 38.50177606167067]]], [[[0.219130961060137, 38.7259165172448], [0.215836910778349, 38.727854109574345], [0.218221061102112, 38.72716680493715], [0.219130961060137, 38.7259165172448]]], [[[0.230770258822109, 38.75374693711688], [0.228513551589493, 38.753962566059826], [0.229537784625314, 38.75728540919543], [0.231461556450726, 38.75657452814858], [0.230770258822109, 38.75374693711688]]], [[[-0.159683214254776, 38.883508377603405], [-0.153761771430022, 38.87188621411273], [-0.155092872560165, 38.86047707413478], [-0.148076337589916, 38.8584307259289], [-0.102096217993308, 38.875028222918374], [-0.095441174974875, 38.874871734006], [-0.092085452653966, 38.87152685270062], [-0.09073386724036, 38.872736431791935], [-0.09217311654759, 38.87446600481326], [-0.089706259234068, 38.87589098213234], [-0.08978879734067, 38.87923543497204], [-0.086157968658917, 38.8803700332351], [-0.082698429837229, 38.87985114864302], [-0.080100159777337, 38.88138073478933], [-0.078279917890179, 38.8805153296405], [-0.078697027236157, 38.88412037891711], [-0.076596053737813, 38.88363530619338], [-0.070620482027223, 38.88571967984986], [-0.06798847124532, 38.88357248385606], [-0.067525078000907, 38.879704987934105], [-0.06522958331095, 38.87862925116862], [-0.064889629366428, 38.874845916610305], [-0.05695697989298, 38.869060542055635], [-0.045894758073101, 38.86458282689513], [-0.042152231970587, 38.856452038175625], [-0.034679106697575, 38.856892999987615], [-0.027397151001919, 38.86159963572301], [-0.028418189628652, 38.867247240268505], [-0.027625047301335, 38.87024500917892], [-0.024795237375313, 38.87233500558439], [-0.026239987965341, 38.873894368113625], [-0.0293268723695, 38.87393696080779], [-0.033358132275702, 38.87926470187702], [-0.037107119960045, 38.880576149790905], [-0.037694372017433, 38.886420988161106], [-0.029620722078718, 38.880169602113625], [-0.015183712094273, 38.87206250283089], [0.00946657224071, 38.86605078722116], [0.013862169961541, 38.863991388682976], [0.020685693808162, 38.865130147931154], [0.033220154665801, 38.860183331791326], [0.036502660697872, 38.859881725826384], [0.042848152354218, 38.86007672657891], [0.050465636893383, 38.863346192819805], [0.054573506923663, 38.863211703795486], [0.07857427517229, 38.856499925614195], [0.0"}},"Comunitat Valenciana","10","Alacant","Alicante","03"]
["FOTOVOLTAICA",null,null,"Con Excedentes (S2) no acogido a compensación que no disponga de un único contrato de acceso (b2)",null,null,null,null,null,null,null,null,"LA-40",0.77800000000000002,null,"AL 3x 1x 25 Mm2",1.2,null,null,"38.8254086192, -1.98037326935",{"$cut":{"chars":32767,"head":"{\"coordinates\": [[[-1.483656580918969, 39.41823993360732], [-1.488449208842398, 39.417392312097476], [-1.487435100718176, 39.41218038717469], [-1.489872498680256, 39.40580592260368], [-1.488137658728827, 39.40062964259043], [-1.481748091233253, 39.401267264900525], [-1.478418255663898, 39.40592696670181], [-1.474546655129939, 39.408777471228134], [-1.470567275626422, 39.4075088706859], [-1.466674472156806, 39.40229493389208], [-1.467437085239164, 39.40088137917677], [-1.475232429916145, 39.398623215639816], [-1.476735507219201, 39.3930566706009], [-1.473305125915086, 39.39114664487643], [-1.466708982735057, 39.39064548876085], [-1.462277439826579, 39.39997540115512], [-1.459901827989726, 39.40079991720189], [-1.455978417121702, 39.4007118801311], [-1.452180190980135, 39.39758899708707], [-1.454476947803038, 39.39297040306494], [-1.452343450799847, 39.390203006187726], [-1.458157385946253, 39.389307136138775], [-1.457588153195087, 39.387209239860226], [-1.452812943605006, 39.38524470804632], [-1.453260577704309, 39.38337658895479], [-1.456076265215762, 39.38310761087535], [-1.459120982700354, 39.386148332771775], [-1.463784783228913, 39.38738133362105], [-1.468192722903327, 39.38333083369694], [-1.462613311826479, 39.37939195308797], [-1.457709075415514, 39.38013794260715], [-1.448789278954674, 39.37819031490812], [-1.448863421406596, 39.376416305639005], [-1.452270131204678, 39.37302884377244], [-1.449466120893655, 39.36649526397924], [-1.455672671921536, 39.36349628794393], [-1.455104217111405, 39.36084878774658], [-1.444266512129048, 39.36175860198223], [-1.442929504575982, 39.367606282110316], [-1.438559014767491, 39.373079943143246], [-1.432175203676169, 39.372516571641974], [-1.434178559049211, 39.376372844955334], [-1.43229398431296, 39.37758184361658], [-1.428611579757574, 39.37612659663255], [-1.427859909053681, 39.37134109425236], [-1.432015483218682, 39.3640899742154], [-1.429348897179811, 39.36188257079547], [-1.426032892072614, 39.3627568019734], [-1.422859602314613, 39.3645068302677], [-1.422226394243915, 39.36633633909835], [-1.42299034312109, 39.3736538632078], [-1.425863733016451, 39.37958537122216], [-1.422321313830045, 39.38119525686353], [-1.414678922601565, 39.38029847961241], [-1.410321687435089, 39.37738285722575], [-1.41029334379127, 39.37351711779018], [-1.408322290039231, 39.37187737062756], [-1.404930801295339, 39.372975202066215], [-1.401010622565675, 39.37688580887211], [-1.398879897763535, 39.37664926785823], [-1.396183405012291, 39.374251481704974], [-1.399778891275694, 39.36880483082006], [-1.408149802724882, 39.368739497950166], [-1.409148672726926, 39.367689987811694], [-1.407787540916882, 39.3657792317381], [-1.401176668061187, 39.36350809758673], [-1.391930150738202, 39.36736306901089], [-1.383726331321758, 39.36623119621075], [-1.381630177284988, 39.359489554823064], [-1.385174163133131, 39.35427690521694], [-1.377499719116983, 39.356404586208164], [-1.366834144817849, 39.35589488785847], [-1.361770476308551, 39.3485976066616], [-1.357563998209661, 39.3473489448907], [-1.354200025761233, 39.34086818897426], [-1.34974512665537, 39.33935443188073], [-1.342717503779777, 39.34017354673892], [-1.33852434589993, 39.337419724950664], [-1.339095036616741, 39.33586013599985], [-1.336644720880882, 39.33399606315413], [-1.330057617447571, 39.33630740826067], [-1.330909127810473, 39.338067586927274], [-1.334842378824083, 39.33953851703885], [-1.333995507361334, 39.34050853100187], [-1.328162586321424, 39.34230796117149], [-1.321804547895655, 39.3393692122356], [-1.318429342014599, 39.34318577961584], [-1.312743996209585, 39.34316654688961], [-1.309828643312353, 39.34039416810359], [-1.299136850783334, 39.337742536013295], [-1.299007010088789, 39.33592064508358], [-1.301687825441715, 39.33397759497513], [-1.29746981207629, 39.330897563928076], [-1.293566245891216, 39.331597226129894], [-1.290590861278463, 39.33467098976029], [-1.285300569382566, 39.33228656308001], [-1.285196518421498, 39.32989737801197], [-1.281898356550862, 39.328614353783024], [-1.279461885650139, 39.32956944922427], [-1.2774589"}},"Castilla - La Mancha","08","Albacete","Albacete","02"]
["EOLICA",null,null,null,null,null,null,null,null,null,null,null,"LA-56",0.61360000000000003,null,"AL 3x 1x 35 Mm2",0.86799999999999999,null,null,"37.1960852121, -2.3448128003",{"$cut":{"chars":32767,"head":"{\"coordinates\": [[[[-2.19104266702894, 36.72003586721019], [-2.191288056221849, 36.720127666825704], [-2.191007156625761, 36.720215925807146], [-2.19104266702894, 36.72003586721019]]], [[[-2.190736548129598, 36.720394387617496], [-2.191146682955724, 36.720793808940755], [-2.190741404421991, 36.720998379884655], [-2.190736548129598, 36.720394387617496]]], [[[-2.193752074859073, 36.72222678920024], [-2.194000397051341, 36.72203914680801], [-2.19419820517865, 36.7224011010835], [-2.193752074859073, 36.72222678920024]]], [[[-2.174758302205815, 36.722367041868516], [-2.174937932025038, 36.72232320092158], [-2.175091426259271, 36.722630768898206], [-2.174758302205815, 36.722367041868516]]], [[[-2.048952114985627, 36.811915457220096], [-2.049598629800621, 36.812218076868255], [-2.049267959046265, 36.81266614809103], [-2.048952114985627, 36.811915457220096]]], [[[-1.651427802893821, 37.34730487879059], [-1.653066712654334, 37.347197407628066], [-1.652306766670063, 37.34802697566385], [-1.651427802893821, 37.34730487879059]]], [[[-1.647879133229741, 37.360090206876485], [-1.648930842136801, 37.35937213459135], [-1.648874235697519, 37.36001142674008], [-1.647879133229741, 37.360090206876485]]], [[[-2.181899523337353, 37.89881736810262], [-2.172003797151853, 37.88868956974414], [-2.163929338729533, 37.89271516119006], [-2.156758285445787, 37.89124885925023], [-2.150713938717229, 37.89567569271293], [-2.151685133422034, 37.89726899894001], [-2.136236455138057, 37.8975349008236], [-2.130020806871343, 37.89994051263454], [-2.123201615599578, 37.9004486286182], [-2.120088232691193, 37.89827125290193], [-2.118078112105821, 37.8942003736666], [-2.11019372462128, 37.89064389724425], [-2.106529080657384, 37.88615476167849], [-2.106305966988507, 37.88485518986192], [-2.108167027423896, 37.88423843077094], [-2.107827574739293, 37.881270685854055], [-2.103494375794888, 37.881327853940874], [-2.09839968306894, 37.87762068012966], [-2.085824144948633, 37.87481975486111], [-2.084570183948627, 37.872322465085325], [-2.081821209821781, 37.87577994764659], [-2.077389260874795, 37.878313872678945], [-2.073852554075348, 37.883792776633655], [-2.070420912434878, 37.884486761179694], [-2.062245962176714, 37.88346668658373], [-2.060470035080856, 37.88272251703365], [-2.059571476353293, 37.880056615204076], [-2.054785992731273, 37.88080243395511], [-2.049969481299411, 37.87952899307823], [-2.050097398700917, 37.87842147383963], [-2.045429786620617, 37.876202701047426], [-2.046263609155482, 37.8750287492523], [-2.044855292436785, 37.8740259689955], [-2.042449313950132, 37.87367300691784], [-2.038789652042769, 37.87530152377502], [-2.025456835036338, 37.868892186197705], [-2.021766768749879, 37.86851014213068], [-2.012898697283091, 37.8736094949507], [-2.004526823738203, 37.8806140916434], [-2.004715004620567, 37.878461634651146], [-2.00324550364791, 37.8769711476062], [-1.998878200163705, 37.8761951522301], [-1.994703833242954, 37.88047670503456], [-1.987973306587975, 37.87373172106507], [-1.982230616826838, 37.8737814168484], [-1.974504268153577, 37.868469107185234], [-1.977390966589827, 37.86032865603819], [-1.988559162663464, 37.853340978796595], [-1.995648241084293, 37.84023397488751], [-1.999515927658616, 37.823142711144804], [-1.99648132161083, 37.81900715505111], [-2.001715801178108, 37.804910677138075], [-2.003913879863648, 37.791797777166366], [-2.008840912821618, 37.77494948324566], [-2.006170217888706, 37.770024075095876], [-2.006078925699651, 37.76666158411428], [-2.004689703570605, 37.766118068883195], [-2.00254018421606, 37.74777704822207], [-1.995837156788559, 37.728045285707395], [-1.999259379593236, 37.7233427286336], [-2.002125779697352, 37.72197902661816], [-2.00408133212083, 37.7225363345928], [-2.007658210681506, 37.71979054923794], [-2.007863218805745, 37.71206833181205], [-2.012655491894644, 37.700599153028634], [-2.01042228908149, 37.698777885042205], [-2.01151514172692, 37.69249609365435], [-2.009776236898817, 37.68678537581693], [-2.011817574838657, 37.67224671120187], [-2.007873898876133, 37.6695097571153], [-2.002004864663477, "}},"Andalucía","01","Almería","Almería","04"]
[null,null,null,null,null,null,null,null,null,null,null,null,"CF-LA56-OL",0.61360000000000003,null,"AL 3x 1x 50 Mm2",0.64100000000000001,null,null,"42.8351264353, -2.72060346921",{"$cut":{"chars":32767,"head":"{\"coordinates\": [[[-3.026794053753935, 43.216649411102836], [-3.018998402751455, 43.210757345621964], [-3.018067283688119, 43.207569815681204], [-3.019915120024165, 43.20691219168907], [-3.01297788114086, 43.204355793713056], [-3.011746359158324, 43.19920519984554], [-3.006528781393084, 43.19612596393314], [-2.987828555716833, 43.200924861992135], [-2.982558582814307, 43.200433406641125], [-2.981200535818956, 43.20238718576398], [-2.979299230858829, 43.20216622225542], [-2.978084260335402, 43.19548447820562], [-2.9730149027954, 43.186253504637236], [-2.969840386837034, 43.18465434368962], [-2.968681289727638, 43.181880568618844], [-2.960632302136905, 43.175273039634014], [-2.955920661827912, 43.17382151181539], [-2.953905867308042, 43.17192971470665], [-2.946282809621106, 43.17037750024957], [-2.953757430588864, 43.159521080781246], [-2.946168448695585, 43.153403450887424], [-2.940787738671367, 43.145688173816986], [-2.939555136015543, 43.14619629223854], [-2.938476148866491, 43.1453222311893], [-2.937339842914144, 43.14263367472138], [-2.939248317328522, 43.13987924602698], [-2.935431989235683, 43.13605911505103], [-2.940921233712481, 43.132640269203215], [-2.942485509642603, 43.12888605174768], [-2.947922424559198, 43.12480501162014], [-2.955611105974242, 43.114704886103624], [-2.957623359160165, 43.11494429908591], [-2.964701954241606, 43.104996389048104], [-2.963947160095497, 43.104532405957286], [-2.974990200188824, 43.099038006937114], [-2.972836945639296, 43.095115893699685], [-2.963018520382333, 43.09418102684874], [-2.950381311121139, 43.08304163612364], [-2.944812746303061, 43.08204402376547], [-2.941117064647765, 43.079160593037614], [-2.941239416986111, 43.07609898774217], [-2.935352237703058, 43.074767519739694], [-2.929367513058204, 43.07178335775868], [-2.927318871815128, 43.06771182671996], [-2.921687677353709, 43.06459689383853], [-2.919066412219277, 43.059966498178305], [-2.912608863816252, 43.05771047018487], [-2.909605237069339, 43.05537135167699], [-2.906516404219383, 43.055224738719595], [-2.895618910066713, 43.04897033499284], [-2.893513461161635, 43.046397473171886], [-2.890205163599651, 43.04565589706879], [-2.889362623813142, 43.048176489641044], [-2.882255702155874, 43.050596173723754], [-2.874186477318428, 43.04991663785102], [-2.864133544161541, 43.051724046042665], [-2.847901357981763, 43.044549086917876], [-2.836544131219453, 43.04173278098073], [-2.822091949588602, 43.03510144095696], [-2.806992595575904, 43.03604039109151], [-2.801086069276565, 43.03365741085024], [-2.781755112184835, 43.03417127320392], [-2.773698429625403, 43.03067961625354], [-2.773963349090856, 43.029059258914494], [-2.769762692075072, 43.02694365465936], [-2.758424967737574, 43.02838799705302], [-2.751029530567219, 43.02682772304908], [-2.746102765307221, 43.03326891081696], [-2.740739708974936, 43.034251895667836], [-2.737986503783154, 43.03264270419858], [-2.733598401605203, 43.025270907054164], [-2.729849345648988, 43.0240058542453], [-2.72140821289407, 43.02688065889806], [-2.715235865220698, 43.03060246413574], [-2.707098711578074, 43.0299064286887], [-2.703697423112784, 43.03111330979325], [-2.701962978420068, 43.02840728184741], [-2.697802690794805, 43.02654577776208], [-2.693077487721632, 43.022354808266286], [-2.690475996303233, 43.021974052686566], [-2.68753652274233, 43.0236409401218], [-2.685233874767824, 43.02122127196875], [-2.676115955769324, 43.02642761063819], [-2.673722226709864, 43.02590298565769], [-2.665934505136372, 43.03181023115886], [-2.656210394001025, 43.02673843289726], [-2.652480773994306, 43.02995994106183], [-2.652560065589558, 43.027753926031025], [-2.643217753721302, 43.021561069069485], [-2.633651584379244, 43.020170928933176], [-2.630117076655603, 43.028939439834005], [-2.633599260208878, 43.03316507514358], [-2.634587124950441, 43.03707643785428], [-2.634785138791897, 43.041322943179374], [-2.633345684668853, 43.04247546086796], [-2.634883992999022, 43.0454610889115], [-2.639210707005399, 43.047361417255885], [-2.644024672611831, 43.05236086007784], [-2.648255943314222, 43.05884860"}},"País Vasco","16","Araba","Álava","01"]
["Propiedad: (Elegir una opción)",null,null,null,null,null,null,null,null,null,null,null,"LA-78",0.42609999999999998,null,"AL 3x 1x 70 Mm2",0.443,null,null,"43.292357861, -5.99350932547","{\"coordinates\": [[[-5.839882173983647, 43.6612276047063], [-5.842258784747101, 43.65718889677588], [-5.839756802407632, 43.655414362040695], [-5.840135685743308, 43.653982375901165], [-5.838444319760078, 43.65414142772432], [-5.837233709658959, 43.652397809005954], [-5.834158182655021, 43.65449994825569], [-5.835528531179919, 43.65199896206511], [-5.835804101969744, 43.64547347404847], [-5.834171359143581, 43.64582012525994], [-5.834545778750686, 43.644028102147814], [-5.82995134882326, 43.64229625005581], [-5.830102316096594, 43.640230680842066], [-5.826336087047075, 43.63949557567706], [-5.823781485889825, 43.64344833890059], [-5.8208243568403, 43.64463782784642], [-5.820926762087803, 43.642852569859365], [-5.819086001781173, 43.6432581680249], [-5.818058447673752, 43.6422301092192], [-5.817682544049805, 43.642941630189185], [-5.816215834142704, 43.6404747810094], [-5.815384959878521, 43.64153071301818], [-5.813574332659823, 43.63992763424217], [-5.81264335103871, 43.642291492790996], [-5.810544999722699, 43.642226117740954], [-5.809824629916577, 43.63262788617839], [-5.806613639662704, 43.63288689202836], [-5.805098962414371, 43.6354991392456], [-5.798888801057335, 43.635246293155426], [-5.797727957623, 43.63640920290364], [-5.795675451827527, 43.634388574713164], [-5.794451349030854, 43.63632731500659], [-5.793160511290042, 43.633351655709], [-5.794023433850298, 43.62950401580436], [-5.790371265689052, 43.63147503978347], [-5.790438430926246, 43.63024890268638], [-5.788130669741076, 43.63073743670866], [-5.788335660797326, 43.629273828001416], [-5.786190720155734, 43.62926313711531], [-5.783400139658227, 43.63137500081479], [-5.783891257607192, 43.62993142503069], [-5.781175601994237, 43.62856599971447], [-5.780834341899291, 43.62707970906976], [-5.782527278137686, 43.62267166502252], [-5.786381691205384, 43.62025477596348], [-5.782871320315067, 43.61911584598579], [-5.787443278885689, 43.61962564304258], [-5.786949148885547, 43.616711488082856], [-5.791876998412135, 43.61420518900546], [-5.788996251314579, 43.613546233632306], [-5.790076328120017, 43.61305167708608], [-5.788883961904071, 43.612189424707935], [-5.785292439007648, 43.61277226217907], [-5.786305427831013, 43.610289525071835], [-5.784084132186885, 43.60914621363254], [-5.781367631259288, 43.61069799022306], [-5.780326399403349, 43.609615892756096], [-5.777949556874561, 43.60993482018413], [-5.778167614824918, 43.60875000589351], [-5.77552124806644, 43.608328153723114], [-5.77649547189043, 43.60661175489051], [-5.775435525432148, 43.60592622200653], [-5.770852022611852, 43.60810837199433], [-5.770048686202731, 43.60599394311015], [-5.767817130001474, 43.60488655419803], [-5.769556855889697, 43.60391702275523], [-5.769204907639452, 43.602728048989306], [-5.770981330605459, 43.60309912785969], [-5.770894562332161, 43.60067021424691], [-5.769708042352036, 43.599114364165786], [-5.767230493290002, 43.59885027125391], [-5.767690444190178, 43.59753356321373], [-5.764900803330424, 43.59505304863928], [-5.759902660632893, 43.59493083488313], [-5.761735787056177, 43.590591749029976], [-5.757882346863921, 43.58948733181131], [-5.759303211250542, 43.58967809313389], [-5.760222408771734, 43.587567037628396], [-5.757163924605324, 43.58460660602917], [-5.755543897432049, 43.5849338368491], [-5.755809460091312, 43.58315367582849], [-5.754541155691074, 43.583589420229295], [-5.75214003080184, 43.58226973698046], [-5.748777218976728, 43.5851238460837], [-5.743592132376946, 43.58223223170634], [-5.743558027837147, 43.57902770967117], [-5.74063215027808, 43.57814355796436], [-5.738686137064618, 43.578928538112706], [-5.739012280309983, 43.57574237363578], [-5.738194655297923, 43.57628418497563], [-5.734975875752245, 43.57384925191993], [-5.71060455514439, 43.568892813011196], [-5.707357037594362, 43.56910830881909], [-5.703512938084432, 43.571940565779414], [-5.701076555218661, 43.57084977296022], [-5.699354626752805, 43.57200648521523], [-5.700785659170042, 43.56897970811806], [-5.695910630582206, 43.56722488313497], [-5.689564961059522, 43.56752987393911], [-5.676233435830299, 43.57099062774509], [-5.684956080832456, 43.56853837501605], [-5.681662450962334, 43.56478293274028], [-5.684388050027172, 43.56738636976072], [-5.693120043796448, 43.56508772566389], [-5.691593698330901, 43.561071982844126], [-5.696133012124071, 43.56679482301977], [-5.700891781646186, 43.56820630302348], [-5.700151177288238, 43.56456123123068], [-5.697771593999501, 43.56551075124338], [-5.697042903997215, 43.564555885243394], [-5.700953911826152, 43.563024146933195], [-5.699653870845252, 43.560944482678714], [-5.696385203360256, 43.562234837047114], [-5.695869989900404, 43.56154318808707], [-5.699575662618301, 43.55904400782675], [-5.696415254701476, 43.55961707865588], [-5.698626300568141, 43.55809661812507], [-5.696216551852196, 43.558208617824455], [-5.692694995139991, 43.555228686082046], [-5.69846481581944, 43.557876981036294], [-5.696374478374092, 43.55508561677784], [-5.697647549235219, 43.55255054791748], [-5.695389781990576, 43.54974104596178], [-5.687889825836797, 43.557434618091186], [-5.68616141422951, 43.55609490493203], [-5.684718359658818, 43.55752881564854], [-5.686282172058268, 43.56054560694168], [-5.683736598071301, 43.55731489809407], [-5.688683771257979, 43.552400457852585], [-5.686242257215223, 43.55046667172283], [-5.688494942690265, 43.55219320904112], [-5.694501580838195, 43.54661725513653], [-5.695195177255608, 43.54537600886426], [-5.691671434942339, 43.54344089106172], [-5.688376490836936, 43.54361185893333], [-5.686855058257654, 43.54483020219496], [-5.687703731740853, 43.545490408807304], [-5.685574805365832, 43.544308291855906], [-5.679380254033518, 43.54547075919224], [-5.681158495189601, 43.5448396208021], [-5.681314042074326, 43.54359450919849], [-5.681225087301609, 43.542256113006815], [-5.679170315056722, 43.54123046297198], [-5.677318079670626, 43.541666810235384], [-5.677064307399545, 43.54351666876528], [-5.67872333582919, 43.54443937395484], [-5.677122143632499, 43.5451957687403], [-5.675351741175547, 43.54524434799726], [-5.677608443018238, 43.5442329501071], [-5.675380410907872, 43.54271659177031], [-5.671753892342878, 43.54217894479556], [-5.66969049537292, 43.54260103792599], [-5.668757656035786, 43.544056313225695], [-5.671187520725901, 43.544955915247684], [-5.668728325143428, 43.54449055510389], [-5.668674076781781, 43.54550251124281], [-5.667837143381022, 43.542613545959846], [-5.666759931302968, 43.543164348778504], [-5.667629434022706, 43.54559001567952], [-5.666314470228333, 43.54338658091403], [-5.666371326399299, 43.54591066408344], [-5.665159807203117, 43.54405929088527], [-5.664275405924443, 43.54516569904099], [-5.665951936230745, 43.54674511768387], [-5.667424766359896, 43.54615635885061], [-5.666768185922107, 43.54739270317642], [-5.670138421424747, 43.54655863879021], [-5.663794777602999, 43.549746263048036], [-5.659644419056553, 43.54770004392914], [-5.661637037765288, 43.5448745279119], [-5.659750634957444, 43.54258413068574], [-5.654669489724229, 43.540989088192056], [-5.644843804283016, 43.540250986982215], [-5.647076964875416, 43.54384337990716], [-5.643394503726124, 43.54494395725322], [-5.643001163802537, 43.54812237121177], [-5.637883208303966, 43.54876156695849], [-5.639094843382789, 43.55132758321437], [-5.637078659169219, 43.552157489099685], [-5.628811112368098, 43.54953167069282], [-5.621801051556229, 43.552687011868606], [-5.621662298675754, 43.55665232765609], [-5.617365464432336, 43.557219754954666], [-5.614030388989952, 43.55605018514238], [-5.614607588001044, 43.554050637004806], [-5.612752811281067, 43.55353944118684], [-5.612979229851817, 43.5516122002268], [-5.609800808916876, 43.54955358799739], [-5.601530271624174, 43.54902600983594], [-5.598381412448633, 43.54767128419034], [-5.593804867978565, 43.54892513381391], [-5.588772795014419, 43.54820097724475], [-5.58511354812868, 43.549472372243706], [-5.585428369008262, 43.550176545780026], [-5.583039075829631, 43.549015080713126], [-5.58051526083546, 43.5496303730492], [-5.579183027828064, 43.54857999375818], [-5.575132395752879, 43.55084131705609], [-5.570745656319146, 43.549571518082395], [-5.568004619706176, 43.550614620031254], [-5.56240656589223, 43.549092617802835], [-5.548147829271138, 43.550311944093785], [-5.535483647195195, 43.54794663512584], [-5.53153619291859, 43.54620637825321], [-5.528016596330309, 43.54699562594317], [-5.525597414405533, 43.549534219020195], [-","Asturias, Principado de","03","Asturias","Asturias","33"]
["VACIO",null,null,null,null,null,null,null,null,null,null,null,"95",0.35199999999999998,null,"AL 3x 1x 95 Mm2",0.32,null,null,"40.5710367492, -4.94553505619",{"$cut":{"chars":32767,"head":"{\"coordinates\": [[[-5.01385768137012, 41.16424852689012], [-5.010939179877887, 41.16196667411882], [-5.007494253052649, 41.16195472324789], [-5.00705814972833, 41.160160883698495], [-5.004446173173884, 41.158927348189756], [-4.989736152598589, 41.160803719930335], [-4.987719271292361, 41.15598363572663], [-4.98257360007235, 41.154892398621804], [-4.984543310842966, 41.15223734277197], [-4.977350196732456, 41.15120813501587], [-4.967611049595922, 41.152302714657736], [-4.964686658748618, 41.149749487794054], [-4.962969194011407, 41.14011400095618], [-4.959817031730603, 41.1386904872067], [-4.950809751937489, 41.140707944986644], [-4.945142426337028, 41.13762413668363], [-4.940811728302382, 41.132581076849156], [-4.931016927839006, 41.12926887414297], [-4.923826484419831, 41.12413796583727], [-4.909018885245052, 41.118763759115836], [-4.905015907897424, 41.1187309309288], [-4.901880121904204, 41.11449523770746], [-4.894111356579824, 41.11313702906877], [-4.889774525746675, 41.10934410025753], [-4.880941796698136, 41.10447149062668], [-4.878941173101907, 41.1053057986823], [-4.874565823407708, 41.1034585107358], [-4.871762572173126, 41.10035145361328], [-4.87024798116307, 41.100267989642354], [-4.872657772099828, 41.09916595296148], [-4.872109394636341, 41.09788680480059], [-4.863676903674412, 41.09401518691373], [-4.855555104036606, 41.10073072300757], [-4.85320634823348, 41.09977774421994], [-4.846557544014895, 41.10046996026098], [-4.827957088827305, 41.099154273609216], [-4.814965195047622, 41.10344905712365], [-4.818900114232688, 41.107953779943244], [-4.817543332963527, 41.109713647742716], [-4.817047111685435, 41.11676536499775], [-4.813392285409286, 41.12202016612702], [-4.81227296659894, 41.12636136270493], [-4.81352341608457, 41.129377170960154], [-4.805843414191748, 41.135163456681326], [-4.79612694322787, 41.13579280504912], [-4.789006562112664, 41.139893896917215], [-4.786186863623579, 41.14355862476199], [-4.778754749138431, 41.14499774124407], [-4.771393742596253, 41.14421943083346], [-4.767077958391945, 41.14235818989483], [-4.748924681857834, 41.14974208568029], [-4.73915628198236, 41.14896225075919], [-4.737395162715633, 41.15041201789781], [-4.729003335791643, 41.15077247108965], [-4.722101183306774, 41.149317633969495], [-4.719652918424688, 41.14090517668298], [-4.719948535120055, 41.1348927408878], [-4.716720846083371, 41.13264401024026], [-4.723809622670244, 41.12855683564388], [-4.724560456144342, 41.12265469081774], [-4.721445269418925, 41.11649501386709], [-4.715123274097277, 41.11064440287776], [-4.716064236899499, 41.104244027638416], [-4.710028646050046, 41.09927152600702], [-4.713343760028464, 41.091664929989804], [-4.717884333259593, 41.090003010797766], [-4.717148642686277, 41.089185257866355], [-4.707346080778951, 41.08948404905094], [-4.707149163780421, 41.088775398903564], [-4.709061042809738, 41.0853691697714], [-4.713464550196491, 41.08302486414145], [-4.714978817813051, 41.07303994196465], [-4.716512119832139, 41.071584917263564], [-4.712719091342809, 41.06210227323318], [-4.703222661809511, 41.05243372465208], [-4.68802080193806, 41.05217093982664], [-4.680111755698934, 41.05091738319991], [-4.671656077422895, 41.04686074689173], [-4.665643636158264, 41.04529041975197], [-4.659563268783471, 41.041477766160135], [-4.659644899591654, 41.04036665568299], [-4.65118817208336, 41.03340102784516], [-4.645081125642894, 41.03130848585861], [-4.638288819150878, 41.031306150016185], [-4.639530617860305, 41.030054424062165], [-4.627231606337308, 41.01654599968517], [-4.62278643059609, 41.00938439102896], [-4.623594104071463, 41.0069229121218], [-4.617247635048209, 41.003652204733605], [-4.618237411404662, 40.997449965643625], [-4.612324640915775, 40.98655231267086], [-4.612233870647869, 40.98282437273652], [-4.60674776039308, 40.97080343915695], [-4.595954960395156, 40.965800828857255], [-4.592950958152472, 40.96590542689072], [-4.575582839719458, 40.960649246875164], [-4.572356287051639, 40.9558740838824], [-4.566351780605903, 40.95619904869621], [-4.565061534854935, 40.95237920279655], [-4.567888"}},"Castilla y León","07","Ávila","Ávila","05"]
["Titular",null,null,null,null,null,null,null,null,null,null,null,"LA-110",0.307,null,"AL 3x 1x120 Mm2",0.253,null,null,"38.7097707381, -6.14158521981",{"$cut":{"chars":32767,"head":"{\"coordinates\": [[[-4.677889020055496, 39.434849094010744], [-4.673276292344092, 39.42707689901367], [-4.669498072582194, 39.424536343161314], [-4.671698315309261, 39.4135486096895], [-4.674468726831996, 39.408940742915895], [-4.682764214831676, 39.40132484010337], [-4.6874110884053, 39.39368014101185], [-4.687894293094966, 39.38578941681355], [-4.693153518553376, 39.3824063799853], [-4.695446976762542, 39.37642637225387], [-4.694275789227721, 39.373596336001555], [-4.704210891267074, 39.364450286594156], [-4.710046005992897, 39.34575010127082], [-4.70598720733345, 39.33058270993577], [-4.706660267365188, 39.32772569294912], [-4.713794632554419, 39.3286660220821], [-4.734777675895351, 39.32664329678671], [-4.761011273257251, 39.320789268761665], [-4.754631039257384, 39.31148823272683], [-4.731572209382135, 39.25491696260611], [-4.733680911985172, 39.252542962145945], [-4.713548365707472, 39.244317336799185], [-4.714447095114959, 39.24220475326658], [-4.710917323309464, 39.22710155364681], [-4.705161167802197, 39.21374271263691], [-4.708229332214036, 39.20986843089245], [-4.699918314139829, 39.20813387785324], [-4.687949516128704, 39.20307298681978], [-4.682601482323015, 39.19295970186243], [-4.677744771282133, 39.19176828470479], [-4.672358977691718, 39.187295541024405], [-4.665164466700923, 39.18611908563401], [-4.663336633151299, 39.18421696993574], [-4.663406077414359, 39.17929634806628], [-4.650290912319702, 39.172905234706896], [-4.647759573935125, 39.169589219972245], [-4.647892860567087, 39.16686623369044], [-4.648969830099935, 39.16490475118414], [-4.655526254269681, 39.165136186079735], [-4.675264052065411, 39.17065681024368], [-4.676546847189468, 39.1695931980701], [-4.714406331363962, 39.187621520819036], [-4.742548828043392, 39.19452034203825], [-4.773639761673636, 39.18950092118395], [-4.810272618785586, 39.199416222065544], [-4.80917929901623, 39.19787441400927], [-4.811374005426227, 39.1958580571492], [-4.813195175273055, 39.19102733963906], [-4.821247412968452, 39.180909438012996], [-4.832221322310853, 39.17507903096422], [-4.830596173842112, 39.16678808383882], [-4.831558106916359, 39.16423221169781], [-4.834020902946459, 39.16324740219878], [-4.838701986162789, 39.163894452163014], [-4.8452097207458, 39.16135882322669], [-4.853169742784089, 39.152438562124374], [-4.855025253427606, 39.14730031178779], [-4.853680455684313, 39.141023599918434], [-4.858118698228171, 39.134681871728105], [-4.856095493680696, 39.131650661976394], [-4.856870570887598, 39.12327686287307], [-4.870624539658863, 39.112361815102666], [-4.874402837574176, 39.10043474568595], [-4.873704680410146, 39.09633731865386], [-4.858415657006607, 39.07683173661562], [-4.850477171178973, 39.07561551672586], [-4.845829966127003, 39.0733825669545], [-4.842920389397026, 39.07350965706776], [-4.836631249956916, 39.07123920672465], [-4.833079489189946, 39.067537811951006], [-4.826935002765121, 39.06412028021706], [-4.825819744339848, 39.06255193159103], [-4.832283643831982, 39.05150303614419], [-4.832792688560809, 39.04616095602957], [-4.838706745437133, 39.044752333976504], [-4.842547252584235, 39.04759303366992], [-4.849171524710743, 39.04550593423626], [-4.852624727714653, 39.03881053875431], [-4.860989899827528, 39.03178446361201], [-4.86740303192965, 39.03404263871338], [-4.875088984262967, 39.031991115771305], [-4.879987107638435, 39.03242583870962], [-4.885598920049232, 39.03363269866994], [-4.902767130992215, 39.041003522811906], [-4.912783173933644, 39.04782254205448], [-4.930903052902078, 39.053839959227055], [-4.935133479188131, 39.05641882978389], [-4.947745744928807, 39.056163733260625], [-4.962504458684152, 39.05872738019436], [-4.960299943569546, 39.047961326826965], [-4.949846088708107, 39.026638428670815], [-4.945279211907127, 39.008784390949685], [-4.937066868376911, 38.99687444708943], [-4.936866094012623, 38.98527262260628], [-4.93366995470704, 38.97557658798435], [-4.918221890870692, 38.95704511764024], [-4.913414276353349, 38.960647082026014], [-4.905072481099098, 38.96330648683746], [-4.893627037080963, 38.95996071487646], [-"}},"Extremadura","11","Badajoz","Badajoz","06"]
["ED","no rellenar",null,null,null,null,null,null,null,null,null,null,"PENGUIN",0.26769999999999999,null,"AL 3x 1x150 Mm2",0.20599999999999999,null,null,"41.7310008895, 1.98405401772",{"$cut":{"chars":32767,"head":"{\"coordinates\": [[[[1.657073101107445, 42.114434338149856], [1.664348370644539, 42.1135529211643], [1.67140699348447, 42.11466067518711], [1.68350557919332, 42.11441846505983], [1.688765120860446, 42.11260956913183], [1.692036566835642, 42.112862673702146], [1.692231970173007, 42.11027066173728], [1.688251461486048, 42.10647222496598], [1.68942809910011, 42.104560341748794], [1.679717827406992, 42.10355315271656], [1.667257738068169, 42.10493505586101], [1.645234203076199, 42.11261040412556], [1.652229939354575, 42.114514176667186], [1.655730169164644, 42.11343553387187], [1.655620920551323, 42.11507862298664], [1.657073101107445, 42.114434338149856]]], [[[1.918568519406662, 42.31777135010412], [1.921540709611485, 42.316995281785125], [1.9332568851999, 42.31866915275691], [1.939646421257305, 42.316457698689085], [1.943603680647167, 42.30845408866025], [1.949870280460958, 42.31565550490136], [1.970679169223907, 42.3032651361188], [1.977703241062447, 42.30144713316933], [1.984190481483613, 42.29805858071694], [1.986890293510979, 42.300299659878206], [1.992452718346661, 42.300246049899265], [1.993669074971119, 42.3025877349766], [2.002637485564212, 42.30510373513685], [2.006183012922985, 42.30759547065225], [2.007555781509879, 42.30686013967494], [2.012985433549901, 42.308332851811194], [2.015119629443387, 42.307564059901445], [2.018879117536619, 42.310298089131656], [2.024052756907171, 42.30916160565691], [2.028598748778425, 42.30624292870205], [2.038334807511735, 42.30513921968939], [2.040419983238595, 42.30209440011333], [2.048018874451668, 42.29763590290198], [2.057397613907672, 42.29557397691188], [2.066701474293291, 42.290174555213945], [2.070258553088472, 42.291583408787886], [2.069910608629478, 42.287709622772525], [2.067296220097386, 42.28384619080092], [2.060183427946179, 42.28254061685061], [2.052706233301584, 42.278801917089105], [2.053485867662405, 42.27809225973924], [2.051874405026355, 42.275228535071335], [2.048777297792798, 42.275005187148466], [2.047414525658456, 42.272670595942586], [2.045535549222139, 42.27251941473399], [2.042584437985431, 42.269570597079436], [2.043622855420111, 42.268003319882965], [2.041072617379163, 42.26491075387167], [2.040261119775442, 42.26051712308772], [2.038352736988336, 42.25938581664273], [2.037373438580871, 42.260023148232854], [2.036307581207597, 42.25851257891864], [2.033597954187194, 42.25857784614873], [2.027433816214418, 42.253312175795486], [2.029030175475708, 42.25342204614537], [2.029593873706747, 42.25137164397498], [2.027791996078133, 42.249442107995975], [2.029235108141779, 42.248543062958056], [2.029931107553014, 42.24495632671641], [2.027107790648693, 42.24221641268048], [2.02815601049975, 42.241233458165205], [2.025040644109825, 42.23983990516257], [2.025157127754709, 42.233237361806424], [2.020992892031824, 42.231906635637955], [2.017070507037964, 42.23270048316961], [2.01974202033759, 42.22836037425113], [2.023535853719238, 42.227321678667344], [2.030546226250285, 42.215858464958174], [2.039806969298377, 42.22112259588513], [2.049264664379625, 42.22139871011502], [2.053656754181331, 42.21952122702839], [2.050492348760115, 42.21584372769575], [2.051874974560752, 42.21359496516464], [2.05083661461846, 42.208329066924634], [2.053932606144788, 42.20054880387827], [2.052869935994222, 42.19573416169935], [2.055758428367671, 42.19476024471671], [2.060642437415792, 42.19527353961539], [2.0639079625957, 42.191599899112084], [2.061990159176227, 42.18896587784539], [2.061306534956898, 42.17981309108903], [2.05958036195047, 42.17911520521826], [2.060873458954899, 42.17787862486717], [2.058378842799542, 42.17710666264963], [2.057751000365749, 42.17545985405092], [2.045661401400804, 42.17593961311675], [2.037382209734507, 42.17897836127239], [2.031726991624847, 42.17696747768495], [2.031854223612029, 42.172172277886936], [2.028631030641889, 42.169991254001246], [2.027678498436768, 42.166377900728534], [2.023111491377998, 42.16403065304171], [2.013282139907426, 42.16399367611767], [2.010847416228878, 42.162587867790734], [2.005193016484391, 42.16208811376564], [2.00426417"}},"Cataluña","09","Barcelona","Barcelona","08"]
[null,null,null,null,null,null,null,null,null,null,null,null,"SPARVIERO",0.25700000000000001,null,"AL 3x 1x185 Mm2",0.16400000000000001,null,null,"43.2376797057, -2.85260007926",{"$cut":{"chars":32767,"head":"{\"coordinates\": [[[[-3.028631798416118, 43.04403138485194], [-3.028450562409216, 43.035800942791575], [-3.018319152429161, 43.03729771012759], [-3.020872674709679, 43.03256519996393], [-3.024572368241023, 43.0290705681772], [-3.033228866695488, 43.024390408201356], [-3.032561439998938, 43.02044194007826], [-3.028080737684849, 43.01864659300365], [-3.018788679370241, 43.017720864748426], [-3.007139281850043, 43.01339969062493], [-2.997856284841752, 43.014264252706845], [-2.986043897894707, 43.01213362665825], [-2.983784334019482, 43.00869789084302], [-2.993776490757508, 42.998667440118645], [-2.986390113096753, 42.992390202846806], [-2.971729982257404, 42.996448630019295], [-2.966934264129385, 42.99919832507338], [-2.966372637413716, 43.00114771920597], [-2.955512548211181, 42.998775586240725], [-2.958283338822988, 42.99444076614245], [-2.967755440181755, 42.991733391963756], [-2.974002312989368, 42.98864183081217], [-2.994544092184657, 42.98842877314545], [-3.000383649079512, 42.98959510919434], [-3.00380365035055, 42.98639829820301], [-3.004459301930322, 42.982197419045846], [-3.024895144600733, 42.982388628861614], [-3.03153810887168, 42.98360728313146], [-3.036956662223872, 42.98223247611815], [-3.04116377273671, 42.982321060114835], [-3.046430543145191, 42.98918998625149], [-3.052911594171042, 42.99441013795191], [-3.060533461590242, 42.99827861682007], [-3.060256255866602, 43.00351067564639], [-3.071767379308405, 43.00561129288123], [-3.07709603825007, 43.00852550868852], [-3.079300059291252, 43.00480496979628], [-3.089417124972853, 43.00175008580028], [-3.090485160760236, 43.00942983103973], [-3.085682963084091, 43.012963427150915], [-3.072829682945952, 43.018456225684645], [-3.072150121806552, 43.019789409773246], [-3.064316260963412, 43.023522039744236], [-3.06312287965121, 43.02837186761337], [-3.064366553144648, 43.03189212273617], [-3.06256174161912, 43.03617045961419], [-3.05048341292374, 43.04640586573791], [-3.048399947590359, 43.04533968292188], [-3.044604464005281, 43.04633170795026], [-3.042839419999125, 43.04384249726067], [-3.028836775099323, 43.04781790124528], [-3.028631798416118, 43.04403138485194]]], [[[-2.493642273440669, 43.36831754510967], [-2.494163156168283, 43.36652797085276], [-2.496591934795253, 43.36526908791719], [-2.496887354759562, 43.36704428393302], [-2.493642273440669, 43.36831754510967]]], [[[-2.689194245919829, 43.38786017185239], [-2.689460827268602, 43.3879464627061], [-2.689519471087031, 43.38824824373242], [-2.689194245919829, 43.38786017185239]]], [[[-2.68743447771932, 43.38838664918774], [-2.687736795846713, 43.38766709365556], [-2.688785605890346, 43.3881021816735], [-2.68743447771932, 43.38838664918774]]], [[[-2.688867287902505, 43.39068666889826], [-2.687130537234488, 43.390024604121976], [-2.687407264156111, 43.38948061512178], [-2.688867287902505, 43.39068666889826]]], [[[-2.691975424649619, 43.39455353661943], [-2.693950392361295, 43.39269493705351], [-2.692404827440208, 43.39509944615796], [-2.691975424649619, 43.39455353661943]]], [[[-2.751934143939754, 43.45683909498985], [-2.74682508894906, 43.45207356806436], [-2.747862908105264, 43.44434559703205], [-2.743582448352817, 43.43865427997875], [-2.74330359961056, 43.435376065649734], [-2.739910766987009, 43.43263103505273], [-2.738741565627238, 43.42958939677576], [-2.735920110931793, 43.42760642174777], [-2.729639926796687, 43.425718799629024], [-2.723301456372752, 43.426640024249316], [-2.722138520762182, 43.425561201812606], [-2.720941248846469, 43.426580259256006], [-2.719599457764461, 43.42568554989042], [-2.721303907709773, 43.42402391393505], [-2.719775403592613, 43.42362848071054], [-2.720262463851447, 43.42189179620622], [-2.718887144948066, 43.42051525495095], [-2.710812929969237, 43.42209335100826], [-2.71842059502382, 43.420149416007916], [-2.717993777584547, 43.41870765583242], [-2.719656066898689, 43.41861270714242], [-2.718891614066598, 43.420303676152166], [-2.7201686159554, 43.4205589412039], [-2.720095349360804, 43.41869031912892], [-2.723545808011566, 43.418410614189796], [-2.722282423684165, 43.4172"}},"País Vasco","16","Bizkaia","Vizcaya","48"]
["230V",null,null,null,null,null,null,null,null,null,null,null,"LA-145",0.24199999999999999,null,"AL 3x 1x240 Mm2",0.125,null,null,"42.3687127267, -3.58574245567","{\"coordinates\": [[[[-2.934887275101909, 42.59440776323082], [-2.939604351116676, 42.59445544870947], [-2.943123053881203, 42.59851894302601], [-2.945214832224251, 42.60388742719942], [-2.940262073313165, 42.607280070121575], [-2.934500477608526, 42.61407624461914], [-2.929736404433018, 42.61121855578924], [-2.929559257557276, 42.60624722079519], [-2.922629318384021, 42.600830190176225], [-2.927657146808386, 42.59614146879425], [-2.934887275101909, 42.59440776323082]]], [[[-2.991941807553828, 42.60455822501702], [-2.999378312105734, 42.60094726497942], [-2.997866542703996, 42.60543209702669], [-2.994086663753729, 42.6104481469337], [-2.994524981425312, 42.6154914367633], [-2.986453458697352, 42.61475218178083], [-2.982857744261858, 42.61079817204102], [-2.985771909586245, 42.609852948136734], [-2.986248058009354, 42.607052229861914], [-2.991941807553828, 42.60455822501702]]], [[[-4.247809752185597, 42.73604327523248], [-4.245059700978763, 42.73597413193977], [-4.251332641099339, 42.72654887306341], [-4.256699097554904, 42.72797602614899], [-4.263150416141488, 42.73048064713153], [-4.260633375342933, 42.738892652266834], [-4.247809752185597, 42.73604327523248]]], [[[-2.826266434188645, 42.785317181641375], [-2.817066789160561, 42.790008124018456], [-2.800800008859167, 42.79288956202936], [-2.797312844147652, 42.79160463497893], [-2.793317937264498, 42.79251149520668], [-2.790468129941967, 42.79104286604109], [-2.773862258078696, 42.794284642074125], [-2.76732199100765, 42.79272701384894], [-2.75821225296648, 42.79389677509034], [-2.743668244648975, 42.79218995811206], [-2.735293402172102, 42.792855266003954], [-2.731552437341655, 42.79445","Castilla y León","07","Burgos","Burgos","09"]
["400V",null,null,null,null,null,null,null,null,null,null,null,"LA-180",0.19600000000000001,null,"AL 3x 1x300 Mm2",0.1,null,null,"39.7118899607, -6.16082194997",{"$cut":{"chars":32767,"head":"{\"coordinates\": [[[-6.230474872455294, 40.486600961948504], [-6.223916728011509, 40.48439758406298], [-6.220885063946166, 40.48488750313929], [-6.21320081122512, 40.48280497800611], [-6.200086866940514, 40.48236764481461], [-6.191239698371821, 40.47215579599175], [-6.187721231864047, 40.47132529677337], [-6.186200003202285, 40.46584621671707], [-6.180437810117775, 40.462195232914574], [-6.169220832828848, 40.4581263771583], [-6.165864693689597, 40.4584706468413], [-6.157051570371833, 40.456604378902135], [-6.152464194015919, 40.45255960292217], [-6.155933723001917, 40.447844380142485], [-6.147526286951305, 40.438472556192984], [-6.147015607288695, 40.43611771991714], [-6.140448312605423, 40.43557593962488], [-6.134269394653857, 40.43730199003238], [-6.132305071079928, 40.43688696178901], [-6.120184427242692, 40.44268224266745], [-6.11612556929436, 40.44158490415466], [-6.117048341212141, 40.43528223579105], [-6.119290255886988, 40.43507758098907], [-6.124170591721688, 40.43050528678883], [-6.125536551078147, 40.42615403761519], [-6.129483265143065, 40.42078715713472], [-6.126990590248245, 40.419638726038805], [-6.123894675080431, 40.42073130926792], [-6.122320290408408, 40.419053603016636], [-6.11887840168544, 40.41929068062237], [-6.117977211792342, 40.41585637207008], [-6.11632337742159, 40.41474810873717], [-6.111059112414309, 40.41507019514447], [-6.107097878879427, 40.414005904974346], [-6.104164102433924, 40.41503956382715], [-6.097890373592393, 40.41339759373683], [-6.093028236727035, 40.411438300666724], [-6.091881759150674, 40.40801931898838], [-6.087731175126986, 40.40872483678076], [-6.085788747988089, 40.407731969094904], [-6.082942928287044, 40.40295321119233], [-6.075152118305389, 40.403404081202], [-6.073891020190373, 40.40080761686732], [-6.06815574512334, 40.39930280413414], [-6.06495833290493, 40.39660448282209], [-6.066629544286492, 40.39501095522959], [-6.069573652256034, 40.396283787833475], [-6.07419235376425, 40.39578266764183], [-6.076668684710814, 40.390663861012975], [-6.083356525220305, 40.39240399208458], [-6.085165708846365, 40.390491208629044], [-6.085076602258373, 40.389313711850775], [-6.082162114438698, 40.3879143679654], [-6.072155355585445, 40.387001024972314], [-6.076299268719904, 40.38126136011248], [-6.083622729276677, 40.3801744159649], [-6.086327949161029, 40.37803054908264], [-6.086368349992592, 40.37504820084709], [-6.081262316934365, 40.3730948968002], [-6.082377852939098, 40.36321147869687], [-6.085579064132809, 40.36085625082997], [-6.090352228259159, 40.36224190577305], [-6.09245942259087, 40.36171708099012], [-6.097288625421285, 40.356354714655495], [-6.103017643722272, 40.35856083025489], [-6.105715195587417, 40.35679498505673], [-6.067724935571006, 40.34753288308107], [-6.052162959966361, 40.341549926669934], [-6.045669299288704, 40.34294622392686], [-6.036607242025954, 40.34220293365001], [-6.027682571306133, 40.33952777060524], [-6.016016376188129, 40.34029218689417], [-6.019584198832502, 40.322644128678306], [-6.016428209728481, 40.31652058165498], [-6.010264396050099, 40.31233081623702], [-6.005319677060741, 40.30537080570601], [-5.992144437131182, 40.29901122170976], [-5.982441592711677, 40.298262102139546], [-5.978879421368808, 40.2969758688884], [-5.975641923627443, 40.293168082980976], [-5.968484960418753, 40.28956001427206], [-5.966134434036166, 40.28987254214986], [-5.964946573769668, 40.29148826105302], [-5.941667256898939, 40.284417727626284], [-5.937782025328751, 40.28106664694026], [-5.920839250199236, 40.280901442140845], [-5.917173138388111, 40.277697305724324], [-5.913977883024691, 40.287082440794386], [-5.907802124448049, 40.290354451743895], [-5.892301275605295, 40.31190146901359], [-5.893459326177404, 40.31862802605534], [-5.885047783029441, 40.32613413667243], [-5.881991454819678, 40.32704806895653], [-5.874065532829501, 40.326641869987675], [-5.867629617654997, 40.331404461957504], [-5.857797576633036, 40.33436812066467], [-5.854976966353817, 40.33837404779787], [-5.852307731183156, 40.33704380601311], [-5.849931682765018, 40.338201282656414], [-5.853"}},"Extremadura","11","Cáceres","Cáceres","10"]
["500V",null,null,null,null,null,null,null,null,null,null,null,"PIPER",0.19,null,"Cu 1x 1,5 Mm2",12.1,null,null,"36.5538729195, -5.7604183752",{"$cut":{"chars":32767,"head":"{\"coordinates\": [[[[-5.437333022160619, 36.064233108628436], [-5.437397347823143, 36.06415969673025], [-5.437530797050182, 36.064165991090135], [-5.437333022160619, 36.064233108628436]]], [[[-5.434644045613278, 36.06523419504757], [-5.434278168984588, 36.06489008455549], [-5.435208748160439, 36.06482613215884], [-5.434644045613278, 36.06523419504757]]], [[[-5.436466070656327, 36.065278273108056], [-5.436596999210655, 36.06520348975986], [-5.436535127745464, 36.06535798113156], [-5.436466070656327, 36.065278273108056]]], [[[-5.436037426043764, 36.06551909757504], [-5.43610355193014, 36.06540282303157], [-5.436211216813537, 36.06565301586414], [-5.436037426043764, 36.06551909757504]]], [[[-5.423345327023653, 36.07617123405928], [-5.423657962302117, 36.076228008949016], [-5.42390064037946, 36.07653857079848], [-5.423345327023653, 36.07617123405928]]], [[[-5.423615965164259, 36.07703105301785], [-5.423961338644909, 36.07706912809191], [-5.424081137072858, 36.07735515377264], [-5.423615965164259, 36.07703105301785]]], [[[-6.005779718694181, 36.181264478870766], [-6.006664253821866, 36.181431491037316], [-6.005927688289499, 36.1814500087686], [-6.005779718694181, 36.181264478870766]]], [[[-6.007923431338857, 36.181420089930654], [-6.009245588842057, 36.1814927230144], [-6.008905124654363, 36.181600402544646], [-6.007923431338857, 36.181420089930654]]], [[[-5.431317788931856, 37.050393996039126], [-5.427736917359805, 37.0445734515693], [-5.427037710065097, 37.03744123517817], [-5.421432009791471, 37.02446119910966], [-5.420108715021076, 37.01321403515826], [-5.425994776800022, 37.005703924031096], [-5.427004041208254, 36.99962713084532], [-5.435238554261429, 36.99112221990554], [-5.442467035943038, 36.989856199137186], [-5.443137463012619, 36.98693151960823], [-5.449875112409533, 36.9826380240419], [-5.452945835223397, 36.98241236668212], [-5.456044074332668, 36.97814867484068], [-5.459582770002214, 36.97850794958405], [-5.460288367911783, 36.975303071975226], [-5.457173309645422, 36.974141954001475], [-5.454556337559738, 36.96120059854963], [-5.445921398672036, 36.95667445194857], [-5.447953102180456, 36.954190287139966], [-5.445428335870439, 36.949682166751934], [-5.446267872588918, 36.94643852986204], [-5.441259723557378, 36.94396409693129], [-5.438950981411929, 36.935287714939406], [-5.433158595950873, 36.93565888799061], [-5.423688849974707, 36.93902488187923], [-5.418920755939961, 36.938779620817115], [-5.412850044556095, 36.94066056560569], [-5.416804155348953, 36.945347615719214], [-5.413171147354388, 36.95119831906275], [-5.413361060188635, 36.95401528380509], [-5.400967715679221, 36.96272904320108], [-5.392392007209767, 36.9732842677349], [-5.382721992620767, 36.979084413933364], [-5.375932055884491, 36.980004555637954], [-5.374094657971974, 36.982330464947005], [-5.373145183632426, 36.98178165703714], [-5.365300664278433, 36.985660297087165], [-5.360757664697667, 36.98515593990632], [-5.359680890997516, 36.992486326667695], [-5.356974458387604, 36.99289154658065], [-5.355962322963678, 36.994317558103624], [-5.352402167440363, 36.994000670160524], [-5.349983272078147, 36.9968153350799], [-5.345140439110057, 36.99754201606687], [-5.339647585202435, 37.00456283812076], [-5.33749644618539, 37.01174296981528], [-5.33087644015812, 37.01613597809629], [-5.329591820555719, 37.01823401491235], [-5.321007802669915, 37.02275517383743], [-5.310034152940646, 37.0326575389347], [-5.302104958387909, 37.03736287626299], [-5.30202991672236, 37.01923161025288], [-5.300223501704029, 37.01374203271142], [-5.293693579631737, 37.0103626547162], [-5.285884128709855, 37.00063578769396], [-5.274033198647079, 36.99057126762434], [-5.26827998063074, 36.97843340796464], [-5.262393732002315, 36.97577891386736], [-5.26218999499417, 36.97307001385118], [-5.25923091031229, 36.96986384214947], [-5.256734070827854, 36.96404421074167], [-5.252032682092825, 36.96038425603682], [-5.23453183308489, 36.94104952563224], [-5.225215250763004, 36.942296955884636], [-5.222757269702815, 36.94465021387863], [-5.220047186339588, 36.950703306578625], [-5.215768227"}},"Andalucía","01","Cádiz","Cádiz","11"]
["600V",null,null,null,null,null,null,null,null,null,null,null,"250 UNE",0.124,null,"Cu 1x 2,5 Mm2",7.41,null,null,"43.1975220484, -4.03002122038",{"$cut":{"chars":32767,"head":"{\"coordinates\": [[[[-3.263816261742692, 43.26583138519676], [-3.249201213754187, 43.25968680985015], [-3.251059211832718, 43.24867913909919], [-3.257300330032662, 43.239674260703474], [-3.269374627987351, 43.23356400191164], [-3.270828283576714, 43.23026937409718], [-3.267919029342004, 43.226867934683206], [-3.268375062689232, 43.22485885101434], [-3.26666225481847, 43.22281427621975], [-3.271554298396114, 43.218327508979826], [-3.269341542137123, 43.2142130766193], [-3.270382103849812, 43.2127878681594], [-3.265857049913535, 43.20667522099141], [-3.26710702239374, 43.20379081988323], [-3.275279066601982, 43.2011466976482], [-3.283025863626055, 43.20000350724686], [-3.285676578230436, 43.19786680415462], [-3.291077417703515, 43.20364260177642], [-3.296658938922957, 43.20641592875927], [-3.297469873282779, 43.20839876217534], [-3.294326457897884, 43.21120728692559], [-3.292517421595552, 43.21910908824042], [-3.296717331213046, 43.221916719156816], [-3.297139097425518, 43.23056911281497], [-3.294849492090576, 43.23292522415792], [-3.292870248398123, 43.240975879005084], [-3.294666487300916, 43.24310990709804], [-3.296172741945117, 43.243205069695506], [-3.298091488594779, 43.24737827624246], [-3.303000919963031, 43.25007581894918], [-3.305839026728948, 43.25348103818576], [-3.303397872012348, 43.256628720744786], [-3.296536049392126, 43.26030246577993], [-3.287388064679424, 43.26212799222134], [-3.279464762176703, 43.26196742766516], [-3.274009199133145, 43.264970721672995], [-3.269799169994001, 43.2668440261414], [-3.263816261742692, 43.26583138519676]]], [[[-3.458902658969634, 43.411498343250784], [-3.458997160839222, 43.41746798680923], [-3.457380318193598, 43.422571010184505], [-3.456821575968374, 43.417269531025426], [-3.458902658969634, 43.411498343250784]]], [[[-3.770330402242169, 43.465579356617766], [-3.771744991896493, 43.465124571679354], [-3.770204002993494, 43.46590599106582], [-3.770330402242169, 43.465579356617766]]], [[[-3.730244465195548, 43.46935694274129], [-3.731794562117237, 43.472822847741064], [-3.72922293698709, 43.47694524694614], [-3.727005160043978, 43.47451006279124], [-3.72820470559566, 43.47040540805262], [-3.730244465195548, 43.46935694274129]]], [[[-3.589882243911093, 43.51366216005357], [-3.579910298368703, 43.51238009178154], [-3.582304381364397, 43.51045908989093], [-3.580491546985068, 43.507190636097235], [-3.578468546355147, 43.50650746021562], [-3.57029825835327, 43.50854712862792], [-3.567833706116808, 43.508262170198314], [-3.567352922386847, 43.507120973691634], [-3.564013932984789, 43.509901700649266], [-3.5595760937845, 43.50760919717677], [-3.558420227016816, 43.50837117491162], [-3.553701843054963, 43.50782664519115], [-3.550001747976713, 43.50906894387944], [-3.546403844346854, 43.50793348305323], [-3.545729142194857, 43.50445199080177], [-3.540886744011398, 43.50382646971695], [-3.541242802952332, 43.50214096606115], [-3.539801412061502, 43.50141837708041], [-3.541303080806232, 43.500582933980596], [-3.539926701890861, 43.49742884185578], [-3.541559655821044, 43.49745718309044], [-3.539849362334738, 43.49569131278242], [-3.544335568626571, 43.495292073071084], [-3.543918348787802, 43.49427653282944], [-3.53778592494062, 43.49174802076037], [-3.536166116956252, 43.49179155717444], [-3.536574837834093, 43.49325738796913], [-3.534268060304244, 43.493943443030915], [-3.531977919573405, 43.49230620195057], [-3.533745507608521, 43.492189974122766], [-3.532298035123222, 43.49072893098689], [-3.527643201577814, 43.49162376089474], [-3.523533434305822, 43.494064686063815], [-3.523645517103832, 43.49558593969649], [-3.521737171148544, 43.493730631258394], [-3.518691644281827, 43.494833936666886], [-3.51337896008084, 43.49258856114186], [-3.514953955607231, 43.488727639638874], [-3.513343190962829, 43.483989471985986], [-3.514693135154379, 43.48130911766119], [-3.511149249917477, 43.48045143112534], [-3.512175023563975, 43.478916114764814], [-3.510591273056833, 43.47879707519101], [-3.508966159622434, 43.47669724100126], [-3.503692969852884, 43.47600000401879], [-3.498767258316745, 43.47"}},"Cantabria","06","Cantabria","Cantabria","39"]
["1000V",null,null,null,null,null,null,null,null,null,null,null,"LA-280 HAWK",0.11899999999999999,null,"Cu 1x 4 Mm2",4.6100000000000003,null,null,"40.2413705852, -0.146777086937",{"$cut":{"chars":31626,"head":"{\"coordinates\": [[[[0.688666451482042, 39.90040737521235], [0.688371866950857, 39.898840578995745], [0.684475788223337, 39.89683905267079], [0.685736446163949, 39.894835480901676], [0.688640032029518, 39.89490513086031], [0.687659176842056, 39.8934052399008], [0.686176254140562, 39.89344347795439], [0.68429981903899, 39.894647054589264], [0.68372801620773, 39.89728615570515], [0.686454803743863, 39.90037872715426], [0.688666451482042, 39.90040737521235]]], [[[0.148515506888581, 40.0864648442097], [0.148195660833323, 40.08614024994734], [0.148100072900543, 40.08661126297362], [0.148515506888581, 40.0864648442097]]], [[[-0.145305550572607, 40.78593059873737], [-0.144709081800332, 40.782430176044116], [-0.147178609805233, 40.77512366774608], [-0.143840682211753, 40.768691182641035], [-0.142238078761711, 40.767111277637966], [-0.138025380727748, 40.765898952637826], [-0.133142684120529, 40.75795967176205], [-0.126839903762778, 40.75331739583027], [-0.112903063152234, 40.748312764825585], [-0.110342101922725, 40.74482601090941], [-0.107479099246997, 40.74339419270116], [-0.096037437135955, 40.741809693921624], [-0.092928951842498, 40.739227481228006], [-0.086472938660166, 40.73819986996122], [-0.079853252433055, 40.73333991406149], [-0.064697987276708, 40.72740696765476], [-0.055907411672726, 40.72673260480316], [-0.053713649392036, 40.72788350371551], [-0.049504861724448, 40.72747867923012], [-0.03141389054149, 40.72243002073973], [-0.028661378849009, 40.726286139182655], [-0.025709805879472, 40.72716476113553], [-0.022637715829772, 40.730210846987944], [-0.017715501434853, 40.73120049308573], [-0.015435741635452, 40.730285885011476], [-0.002867279544339, 40.73068943170792], [0.015737721119044, 40.728430036860935], [0.017917918838908, 40.725851124679586], [0.0160959728476, 40.723259838994466], [0.01873601726311, 40.71959704999954], [0.024347103835347, 40.717243415616025], [0.02836526720299, 40.71318401800139], [0.024498920016696, 40.70726895067016], [0.024204731642598, 40.702340986169396], [0.025977027748119, 40.70227645883799], [0.026837470059917, 40.700371480690926], [0.025448353932037, 40.697138497152906], [0.026438063813261, 40.694950876140844], [0.036688511348497, 40.69344753409732], [0.042174508415743, 40.69100628119249], [0.072686528151789, 40.71430839261172], [0.112500505637199, 40.72713777489082], [0.111877914754737, 40.72470480774419], [0.116524597885755, 40.72508369886397], [0.123794111914799, 40.72079803919054], [0.143917120779685, 40.718251724841885], [0.163809638112366, 40.723606669838865], [0.164657130310989, 40.72774433270578], [0.168362808418931, 40.72948881977699], [0.170724266400203, 40.73283726224397], [0.182227612228698, 40.72826020989644], [0.185554417780643, 40.72825835075548], [0.191032885169192, 40.73115991099751], [0.197292413442862, 40.724168667681155], [0.211920822075116, 40.72948987901165], [0.21611470489552, 40.73224583274988], [0.226116541879377, 40.73316405973726], [0.22414181311947, 40.72562705669107], [0.22662810997585, 40.717064497057294], [0.234770244777039, 40.70628070224722], [0.236523855924698, 40.70168324589738], [0.241880344674154, 40.700370824168516], [0.25130440592849, 40.70482465898549], [0.262432184103029, 40.70585208287226], [0.266036294193355, 40.703561487645246], [0.27013095719232, 40.703076138821395], [0.276888698309096, 40.694400247153176], [0.280983462817784, 40.69368939264435], [0.286565832945362, 40.69002692973063], [0.291841264910077, 40.688552475648414], [0.292325769461946, 40.68517925871573], [0.285406412442441, 40.67896412505027], [0.282125019423024, 40.672852209866086], [0.274232965715479, 40.66967218410696], [0.272235891362839, 40.66439710391967], [0.268176279727927, 40.65899967793473], [0.269474747758836, 40.647823235814506], [0.266474162707362, 40.6461773942216], [0.266543997737533, 40.6442221828685], [0.270607674249143, 40.64052139618811], [0.271337163752077, 40.638268818631516], [0.276161913633647, 40.63684277463213], [0.27917469421347, 40.63005590724796], [0.283407589968373, 40.62718011399375], [0.29263745162804, 40.62327783082528], [0.298753258439416, 40.626004"}},"Comunitat Valenciana","10","Castelló","Castellón","12"]
[null,null,null,null,null,null,null,null,null,null,null,null,"LA-380 GULL",8.5699999999999998E-2,null,"Cu 1x 6 Mm2",3.08,null,null,"35.8934069863, -5.34342403891","{\"coordinates\": [[[-5.367106021081503, 35.91756866215785], [-5.364440096202644, 35.91715245916041], [-5.360776608370528, 35.914083253647945], [-5.359829317835385, 35.91457512667645], [-5.359961572303087, 35.91339849203225], [-5.355270009340645, 35.91045520599869], [-5.348087060565825, 35.907727255822024], [-5.343726994807862, 35.89974058698379], [-5.336271819671044, 35.89458347164708], [-5.333842117576006, 35.89399974865937], [-5.326742296202607, 35.8961048382203], [-5.325558410082889, 35.89779759984486], [-5.322659118164633, 35.899129195582006], [-5.320062654616885, 35.898965291135376], [-5.314995241929483, 35.89665866764147], [-5.311266997243375, 35.89607244717642], [-5.312324634133105, 35.895360295679865], [-5.312254455048144, 35.89579203497369], [-5.314968740730227, 35.896104809111925], [-5.32006032977694, 35.898458303794214], [-5.322959654034523, 35.89847888714491], [-5.325103354102692, 35.8974976776821], [-5.31789499198852, 35.89188842382006], [-5.319280811299231, 35.89165435154332], [-5.317352764391408, 35.891137208873495], [-5.31444675487149, 35.89326873892449], [-5.317868504264072, 35.889531784899496], [-5.313411874104593, 35.88886284154081], [-5.313086468376083, 35.88994399583467], [-5.31493729700038, 35.89086831122402], [-5.312866241892596, 35.89004965781388], [-5.312028531449105, 35.889038206777386], [-5.304557013262333, 35.890615044199684], [-5.301777122716668, 35.89317874356602], [-5.301980751028665, 35.894567509050674], [-5.30784999095556, 35.89554552378467], [-5.301052768882284, 35.89495487782119], [-5.297909436142318, 35.90148034168947], [-5.290411046650486, 35.903507531989305], [-5.288659330948085, 35.905785417205045], [-5.283982029639153, 35.90314779223817], [-5.283600251931531, 35.90073028597527], [-5.281328113439006, 35.89986533369547], [-5.278694022158931, 35.90059589175895], [-5.279089590802706, 35.89787518061656], [-5.278154216419883, 35.897805060881154], [-5.280309300837599, 35.896103320220185], [-5.280542631944479, 35.89419917570213], [-5.282891694073121, 35.89484411306493], [-5.287191858371303, 35.89061582581292], [-5.294172092420789, 35.88844774224479], [-5.296597838335357, 35.8896430657979], [-5.300243995869034, 35.88591133512242], [-5.305966584927441, 35.884314263156405], [-5.310966637443305, 35.884970814657954], [-5.315455847701499, 35.88707696813824], [-5.319352451943147, 35.88709868325248], [-5.327613963862168, 35.87860995821825], [-5.333785387169118, 35.87952451790874], [-5.337586676565867, 35.87848384455685], [-5.343811219052269, 35.871029745771516], [-5.347873310935583, 35.87221905673683], [-5.349815620395147, 35.87565370085679], [-5.35134283004004, 35.87271004708937], [-5.35518750357338, 35.872686555535665], [-5.356892467355127, 35.874455881256225], [-5.35876400843491, 35.87440337362747], [-5.360366666682158, 35.877384772064424], [-5.368412386201953, 35.87932885771758], [-5.371911688949649, 35.881524514156794], [-5.375727768209247, 35.889252802162225], [-5.37491057618513, 35.89385246584663], [-5.377829550191266, 35.895924177078385], [-5.376763246355753, 35.90445207580826], [-5.379844598036025, 35.910736728188006], [-5.381994544988687, 35.91219488304254], [-5.378474805568268, 35.91633213220213], [-5.369810350735309, 35.9163570367521], [-5.367106021081503, 35.91756866215785]]], \"type\": \"Polygon\"}","Ceuta","18","Ceuta","Ceuta","51"]
[null,null,null,null,null,null,null,null,null,null,null,null,"LA-455 CONDOR",7.1800000000000003E-2,null,"Cu 1x10 Mm2",1.83,null,null,"38.9256128254, -3.82809764894",{"$cut":{"chars":32767,"head":"{\"coordinates\": [[[[-4.76775930538213, 39.51561548013295], [-4.762473307433299, 39.51403793709947], [-4.751709428695976, 39.50183023403946], [-4.750471514301803, 39.497452129248195], [-4.742851156950577, 39.487547683161054], [-4.745803332689621, 39.48238582168306], [-4.747155184902812, 39.47647309495572], [-4.745871424089813, 39.47255509966014], [-4.749187706776427, 39.47036089209989], [-4.749950998086874, 39.468349235998296], [-4.740510680919434, 39.45616540300451], [-4.744969134658864, 39.45133240660328], [-4.751835176666058, 39.44892267178582], [-4.766983548150551, 39.43352997390031], [-4.767941345381203, 39.43097462314149], [-4.766894876347152, 39.42404389970171], [-4.753709391132112, 39.42542374197471], [-4.756523982698879, 39.42046187319794], [-4.755370962692349, 39.415713050867616], [-4.761154013759229, 39.41011158581864], [-4.764722053795788, 39.40421912811661], [-4.774613037774952, 39.39719414087103], [-4.7884050277406, 39.39886600398506], [-4.795948691424399, 39.39687571897027], [-4.805904946992091, 39.397496436830686], [-4.810433181862821, 39.39657012568322], [-4.816294260595359, 39.39331631466347], [-4.821135153202381, 39.393267650870214], [-4.832019075607743, 39.38941172774367], [-4.832813489051195, 39.38782247607618], [-4.845544291086867, 39.37920607105877], [-4.849894890398335, 39.38173177486009], [-4.853180872012106, 39.379111713004406], [-4.855824079395647, 39.37897041419892], [-4.856818367091465, 39.38100878666389], [-4.860708825958257, 39.379739338075915], [-4.863380774939396, 39.37500241894965], [-4.864170278191468, 39.37588174873708], [-4.865884437128385, 39.37442167694841], [-4.868174312856199, 39.374970620653365], [-4.870933585269412, 39.36831310217759], [-4.878156591719369, 39.37232318669937], [-4.882141827340157, 39.37288945483187], [-4.887569029671911, 39.370531047603905], [-4.896155648180382, 39.373842159237356], [-4.90200106658253, 39.37450358359126], [-4.903298134139827, 39.37567160959675], [-4.903424925952264, 39.37905728092187], [-4.905767070154865, 39.379802760191794], [-4.910288230792752, 39.37871049316985], [-4.915372370110761, 39.38378051411714], [-4.921499097740756, 39.38746357497657], [-4.932089484847269, 39.38793686964679], [-4.934394405559455, 39.39571904186119], [-4.940741146772238, 39.39511777375187], [-4.942170604442822, 39.399346541974374], [-4.941420039565053, 39.40243137859356], [-4.931792817122994, 39.4255755322066], [-4.926652946324789, 39.43424708093225], [-4.919929421139135, 39.45637798803185], [-4.910975963007978, 39.47915779484159], [-4.911717196186565, 39.48245217685089], [-4.908210954851624, 39.49369074877914], [-4.902995279718177, 39.50369590770734], [-4.89932021709361, 39.506260665878486], [-4.898039410839614, 39.51261537678152], [-4.891620846624901, 39.519125811202144], [-4.888949429446531, 39.526575136758744], [-4.879739348689772, 39.53836491404221], [-4.87216302316054, 39.543946973618645], [-4.863121787049661, 39.5561471500223], [-4.848117219672494, 39.55212514763971], [-4.810969415002015, 39.52980738679004], [-4.786047655297251, 39.52524667826099], [-4.779773518620743, 39.52009923860349], [-4.7713716512268, 39.51815531809997], [-4.76775930538213, 39.51561548013295]]], [[[-4.138967955356841, 39.56645069103472], [-4.124346233784096, 39.563556522924316], [-4.10144951568168, 39.56582995224239], [-4.089465051052041, 39.56919551919846], [-4.081857067095503, 39.5680681849996], [-4.078446273556158, 39.5703434316045], [-4.072280631806416, 39.57215743317029], [-4.054029143360646, 39.57318025108639], [-4.041778727101293, 39.57535400063752], [-4.039591500064359, 39.57390489377563], [-4.039650512192006, 39.567714375225435], [-4.037838531212167, 39.565649206074475], [-4.03990795228446, 39.55922448921891], [-4.036275337751988, 39.548985252660316], [-4.030080471111082, 39.52197354573607], [-4.034746871364056, 39.52126535579769], [-4.038959909859432, 39.52215589274588], [-4.043358496275066, 39.52065684391009], [-4.050751910439436, 39.52259962312253], [-4.060076567717402, 39.521442795821535], [-4.064969225742646, 39.50661227100962], [-4.06824522707365, 39.50254564220245], [-4.0650"}},"Castilla - La Mancha","08","Ciudad Real","Ciudad Real","13"]
[1,"999999999999",null,null,null,null,null,null,null,null,null,null,"RAIL",5.9799999999999999E-2,null,"Cu 1x16 Mm2",1.1499999999999999,null,null,"37.9926944409, -4.80926161095",{"$cut":{"chars":32767,"head":"{\"coordinates\": [[[[-5.081139913319542, 37.64655305418955], [-5.053790196047969, 37.64237316887993], [-5.048797577091102, 37.63719703899687], [-5.048550208011391, 37.63355154583869], [-5.046795005947343, 37.63194180712188], [-5.034249106841576, 37.63852114056338], [-5.033516650203274, 37.642003312674554], [-5.031191617110215, 37.641520673577496], [-5.029122066680529, 37.637095441076575], [-5.026497069046111, 37.635157934610675], [-5.030031850755877, 37.632213377067735], [-5.02971643429334, 37.627280287649235], [-5.033444733776592, 37.62480089019945], [-5.033857220392099, 37.62163964080442], [-5.029742469266908, 37.61364480590031], [-5.02832731457224, 37.60408041564132], [-5.025996207969506, 37.59956942821227], [-5.024611278889286, 37.594852891598194], [-5.017260471818809, 37.5935819222578], [-5.018149326046373, 37.59210675197119], [-5.018788369573163, 37.5931231945785], [-5.024579325814619, 37.59367286726399], [-5.026597391998683, 37.59542261487394], [-5.030235105368697, 37.60384034761882], [-5.03100792690598, 37.6106040761815], [-5.047910027217381, 37.60814009123839], [-5.040405634284514, 37.62619477503894], [-5.047385817129995, 37.63076004620914], [-5.084972784786714, 37.643790831750515], [-5.084322037110065, 37.648082949067216], [-5.081139913319542, 37.64655305418955]]], [[[-5.035409177724707, 38.72618847002159], [-5.032740378236977, 38.72536996788222], [-5.024695790594492, 38.72643770980864], [-5.017213876204976, 38.71889013691233], [-5.01221228038346, 38.71771494102527], [-5.004468585242052, 38.71182899362815], [-5.002020700347332, 38.708176619993814], [-5.000435215193356, 38.70121162825281], [-5.000932633925737, 38.69677896319483], [-5.004599412286783, 38.69509425882032], [-4.95516408105416, 38.68343385515559], [-4.94086927887112, 38.681527538034125], [-4.923776050304918, 38.68198119789318], [-4.91877025306285, 38.68609121692369], [-4.910808022965604, 38.68669918278258], [-4.899297446597828, 38.686598340614424], [-4.891013443559047, 38.6850386441526], [-4.884850042207575, 38.68760472103524], [-4.876969712413145, 38.686093868194455], [-4.868880066174306, 38.6809341537028], [-4.870890203827734, 38.67513511973718], [-4.868938550990906, 38.6694805860878], [-4.869668740281431, 38.666179972891534], [-4.866933874196151, 38.65867265113269], [-4.868107386570923, 38.64766071580077], [-4.864051565826667, 38.64012931067287], [-4.867496108172932, 38.63163118702971], [-4.864549809212449, 38.62077505780131], [-4.860170456625347, 38.61397850911168], [-4.851483092057747, 38.612899798680665], [-4.835198727234598, 38.60752437189136], [-4.821208076640501, 38.596488146256], [-4.816298704561068, 38.595320896801326], [-4.80162196117711, 38.5947456428031], [-4.787544880974611, 38.59705193676064], [-4.77997765627746, 38.593779081743605], [-4.770871709126847, 38.587663433599204], [-4.761348737071806, 38.58556327814695], [-4.755216904316092, 38.5855111726004], [-4.74738354563121, 38.57967198291882], [-4.738512447740249, 38.577398073591745], [-4.733406906958936, 38.57464421598435], [-4.720340058650137, 38.57110628271895], [-4.711353370938335, 38.57258961294342], [-4.707366600096666, 38.57194490995297], [-4.705061216752098, 38.57007716664081], [-4.705473367397721, 38.56420489783835], [-4.701375131799007, 38.56270558101694], [-4.700531063978286, 38.56049207400435], [-4.705405886851884, 38.55649235693842], [-4.703950371749902, 38.55317036758067], [-4.69414364525283, 38.54896924717207], [-4.682852604564011, 38.54798756712829], [-4.679493645613215, 38.5466390427619], [-4.666036334684791, 38.54772337026338], [-4.657628605783628, 38.53985873284681], [-4.649880465778184, 38.53517419474129], [-4.6398580340185, 38.53183658497661], [-4.632524474601524, 38.52459488484005], [-4.622779173106962, 38.523793134043295], [-4.620299981924633, 38.52065551182687], [-4.621454409591191, 38.51740446189374], [-4.618828946629384, 38.51233138520543], [-4.619012596409445, 38.50823771883423], [-4.611241349039946, 38.50018967899055], [-4.609016507745486, 38.49502073204974], [-4.596122919302233, 38.490087712625645], [-4.593690907638542, 38.486381144820534], [-4.588462551886"}},"Andalucía","01","Córdoba","Córdoba","14"]
[null,null,null,null,null,null,null,null,null,null,null,null,"LA-545 CARDINAL",5.96E-2,null,"Cu 1x 25 Mm2",0.72699999999999998,null,null,"39.8960496846, -2.19567153274",{"$cut":{"chars":32767,"head":"{\"coordinates\": [[[-2.152110668965416, 40.65769333663606], [-2.146997009210553, 40.65796191874203], [-2.133739211411779, 40.65591729585699], [-2.11935365243561, 40.650646510654816], [-2.111207042228023, 40.65043086579387], [-2.110117984066405, 40.65138640868939], [-2.091202071093766, 40.646365314776745], [-2.091811815169287, 40.64327112607672], [-2.083602850202889, 40.63472012164897], [-2.070953911639054, 40.628466107827656], [-2.068792942357885, 40.62911529784161], [-2.063470798896919, 40.62751374320472], [-2.057524101734768, 40.62410512513592], [-2.05745237395424, 40.61827596325479], [-2.052262889202896, 40.61490027862877], [-2.047496839733715, 40.60921254486767], [-2.035798031279618, 40.601566153982105], [-2.029181240322827, 40.59897925015327], [-2.022918284078328, 40.59890845000359], [-2.005573031362536, 40.59141817192888], [-2.000996886642754, 40.591603908856065], [-1.992367599954959, 40.58941184788626], [-1.985526587706514, 40.58543317493154], [-1.973466486726609, 40.58977679582423], [-1.969924329848341, 40.5895831058447], [-1.965905040891736, 40.59197950474066], [-1.963856430191339, 40.5991320000904], [-1.968119553357093, 40.60857522013889], [-1.964456936890785, 40.61152427068343], [-1.961083744134339, 40.611034539258895], [-1.954066423138421, 40.60015177460634], [-1.948228520940213, 40.6008644070924], [-1.941835416777364, 40.600049317681346], [-1.938501619637648, 40.59711788266699], [-1.929058561710318, 40.59342723115275], [-1.926448324294311, 40.594069645733875], [-1.924971430186856, 40.59183979887373], [-1.923422725653854, 40.59187936823695], [-1.920591368828932, 40.585700044089954], [-1.916490333181505, 40.58282385475541], [-1.917416266270754, 40.5810939372079], [-1.915764581568539, 40.580204582898716], [-1.916755021779973, 40.57740315863543], [-1.914586465327893, 40.57341897587175], [-1.915954385706574, 40.57137785484939], [-1.914966187690071, 40.56819756112509], [-1.909840628851002, 40.561563909939615], [-1.910981410210072, 40.559691876127914], [-1.909445581230081, 40.557524290726704], [-1.910219426846771, 40.55423445586297], [-1.907973327819372, 40.55290695187889], [-1.908183352136129, 40.54943159362132], [-1.904488027112018, 40.546459754185804], [-1.909135021059936, 40.54318852386942], [-1.909467065338402, 40.54165113723573], [-1.899805782374105, 40.54103702166615], [-1.899262367204155, 40.53456359498027], [-1.896611144153369, 40.53423200476741], [-1.895399977096779, 40.53249077214702], [-1.88994422900026, 40.53040244083044], [-1.882002017859147, 40.51882173414278], [-1.881498124070245, 40.51717721773487], [-1.884003669128094, 40.514147503150916], [-1.883918575314504, 40.51002975800556], [-1.887814979231818, 40.505662063001985], [-1.879635632618638, 40.49434007482233], [-1.880310818962551, 40.492058387072376], [-1.878052813664393, 40.4916040287827], [-1.880849903354441, 40.489442064915195], [-1.877478844995079, 40.48710312866325], [-1.875752153661591, 40.47886131395094], [-1.871229140697646, 40.477024477963084], [-1.873579367042871, 40.47686727222904], [-1.873260703170568, 40.47335070169197], [-1.868717141244449, 40.469945999153225], [-1.86699432434484, 40.469983194706316], [-1.860830263629937, 40.46478759279093], [-1.861721519054263, 40.46300359360578], [-1.859999532197892, 40.460905603202484], [-1.860739840111711, 40.458976025908235], [-1.86507678323425, 40.45496467508544], [-1.860059257587847, 40.44760922776235], [-1.862394005960758, 40.44411878179412], [-1.857513977350078, 40.44193553882727], [-1.856463391337078, 40.42879030509482], [-1.850971727697162, 40.426600749727356], [-1.850829525286028, 40.425256999260704], [-1.853302969945538, 40.423993314718004], [-1.851276590751811, 40.42184711024487], [-1.844359899932322, 40.41894037308626], [-1.837904645826507, 40.42760516295257], [-1.836724857821102, 40.42765637017801], [-1.832599717679699, 40.42215539897523], [-1.832743564906103, 40.41997671976741], [-1.823732358576917, 40.410831507250926], [-1.814226278442488, 40.40450923763064], [-1.811887874824778, 40.40010692382319], [-1.806359117051837, 40.3982301427434], [-1.802883467843909, 40.39886986667602], [-1"}},"Castilla - La Mancha","08","Cuenca","Cuenca","16"]
["INDIVIDUAL",null,null,null,null,null,null,null,null,null,null,null,"LA-635 FINCH",5.11E-2,null,"Cu 1x 35 Mm2",0.52400000000000002,null,null,"43.1437759117, -2.19417845709",{"$cut":{"chars":27424,"head":"{\"coordinates\": [[[[-1.998025182427766, 43.32285192026762], [-1.997073576386027, 43.32212771701819], [-1.998170286397281, 43.32115140121225], [-2.001497939060519, 43.32071684787612], [-2.001014425350343, 43.32195523088145], [-1.998025182427766, 43.32285192026762]]], [[[-1.791134272885536, 43.39579802126003], [-1.790554680762533, 43.3950625301012], [-1.792319301662248, 43.39352342416324], [-1.788623768228984, 43.39301167482143], [-1.791022703923886, 43.39178541215362], [-1.7908433319212, 43.39091008704533], [-1.788443900356285, 43.39069113204697], [-1.789808632614031, 43.38881017919849], [-1.789256763398988, 43.38695848674173], [-1.791366779338952, 43.387520996902104], [-1.797432387393637, 43.382191536822546], [-1.797788658337027, 43.37732413512425], [-1.793404544678878, 43.375089989140164], [-1.789351841987009, 43.380440596211606], [-1.786953177583327, 43.38028015468442], [-1.790963547167452, 43.37446998474248], [-1.790025207445894, 43.369904019030386], [-1.787309105370222, 43.366341212256046], [-1.780045242642888, 43.36352684496267], [-1.782525401310814, 43.359195265238476], [-1.788217182646523, 43.355802640632916], [-1.787584262036741, 43.35180262691826], [-1.783398197254384, 43.34852578025971], [-1.777649884039495, 43.34795581206175], [-1.776367665633872, 43.34426393164536], [-1.771784564360533, 43.34226098122499], [-1.761032474214686, 43.34420702781738], [-1.75726208237218, 43.343702452905234], [-1.75294136192536, 43.34093170494878], [-1.751462577762487, 43.336188424887155], [-1.752819586305444, 43.33370008671749], [-1.750544228250901, 43.33172138218479], [-1.74804517531763, 43.330879215861685], [-1.741601584937495, 43.33170894875167], [-1.737805695313907, 43.33035709372023], [-1.738254731683405, 43.3204395787964], [-1.741676814350894, 43.3164974562324], [-1.737914943927214, 43.31369626771461], [-1.740187943005763, 43.311155124675224], [-1.735525231235341, 43.30996926165294], [-1.733239094295763, 43.30148915707284], [-1.730914373816411, 43.29692984016272], [-1.729139396239745, 43.296123285862876], [-1.730170040551739, 43.29574711776644], [-1.729381044847772, 43.29363868306296], [-1.733836933897125, 43.29537127425262], [-1.736203574259222, 43.29467989317403], [-1.737809685630423, 43.29611015995038], [-1.740952915962413, 43.293593808851284], [-1.74286913026121, 43.294634598666036], [-1.745229774368799, 43.293142167734665], [-1.749034613907541, 43.29316303578833], [-1.753802194105887, 43.289203714871086], [-1.755823719702167, 43.290489121112394], [-1.758210503886227, 43.29022355121606], [-1.760961712123099, 43.28934902766523], [-1.761434542169527, 43.28784258799738], [-1.764982665657914, 43.285764990924484], [-1.77213763370824, 43.288528029031305], [-1.779361376776682, 43.28769537594336], [-1.786669109629236, 43.28038525164578], [-1.794312972298168, 43.27624260474727], [-1.791261908216022, 43.269327296043514], [-1.795127914940795, 43.26477262176063], [-1.793094792992504, 43.25679038279136], [-1.795723057799618, 43.254162427797255], [-1.794874339400651, 43.246525262885754], [-1.797858984745662, 43.24512162823204], [-1.803818066082416, 43.244540845702254], [-1.805615778222198, 43.23992528565052], [-1.807289823788472, 43.2389511628212], [-1.816897665976537, 43.23832719505687], [-1.818832552656904, 43.23901743317899], [-1.822485010973972, 43.2358231317215], [-1.822728336736662, 43.23114229681252], [-1.825736361635248, 43.22828734995576], [-1.830324048808051, 43.22913573193733], [-1.832530218619421, 43.22741989111141], [-1.835024860824688, 43.2286546950126], [-1.834317440233327, 43.224546037125386], [-1.83608969232144, 43.22600418600206], [-1.841031277986958, 43.224095910802376], [-1.845048481055445, 43.22535604981046], [-1.847131642758274, 43.22364598211478], [-1.849884091568623, 43.22501251468701], [-1.848683524632412, 43.22750587984623], [-1.849766624268818, 43.22851341913652], [-1.852800838651136, 43.22611442765494], [-1.850567966418034, 43.22322469319794], [-1.853400256592448, 43.22099247973586], [-1.852979223405345, 43.21914965683133], [-1.85415071636737, 43.2182699589417], [-1.855846408636984, 43.219558264195285], [-1"}},"País Vasco","16","Gipuzcoa","Guipúzcoa","20"]
["COLECTIVO",null,null,null,null,null,null,null,null,null,null,null,"C50",0.35899999999999999,null,"Cu 1x 50 Mm2",0.38700000000000001,null,null,"42.1280117119, 2.6735559327","{\"coordinates\": [[[[2.792737760435918, 41.6706119721016], [2.792350572175031, 41.669911449891316], [2.792312064093614, 41.6704174738026], [2.792737760435918, 41.6706119721016]]], [[[2.803617945862853, 41.67290559895409], [2.803240969650009, 41.67285269602872], [2.803654332123414, 41.67330884863492], [2.803617945862853, 41.67290559895409]]], [[[2.804464452610592, 41.6731057448976], [2.804074546945931, 41.672909482025275], [2.804499837249646, 41.67336502697932], [2.804464452610592, 41.6731057448976]]], [[[2.839009773265498, 41.692449979962646], [2.838689982007078, 41.69236726414955], [2.839031737972491, 41.692691901807606], [2.839009773265498, 41.692449979962646]]], [[[2.887107195996662, 41.701338471137916], [2.88650287684631, 41.70129756698967], [2.886879570089862, 41.701476199755064], [2.887107195996662, 41.701338471137916]]], [[[2.896398876132766, 41.70350687487963], [2.895963571410131, 41.7034752757878], [2.896713732047025, 41.70379671123372], [2.896398876132766, 41.70350687487963]]], [[[2.911998979851707, 41.70777934894273], [2.912667323729089, 41.7073397526761], [2.912293779978995, 41.70719702960974], [2.911998979851707, 41.70777934894273]]], [[[2.940784140307176, 41.71976482969205], [2.939913811136164, 41.720098038925116], [2.940347805216783, 41.7206335979893], [2.940784140307176, 41.71976482969205]]], [[[2.946589801078994, 41.72550350199343], [2.946293350746592, 41.72554588584409], [2.946290649512467, 41.72590612297436], [2.946589801078994, 41.72550350199343]]], [[[2.946002346899743, 41.72577704317379], [2.945914752176196, 41.72625868285903], [2.946207888623519, 41.72618046563178], [2.946002346899743, 41.72577704317379]]], [[[3.028718121534957, 41.77055437219666], [3.028202793988266, 41.77057249515611], [3.028481002232175, 41.77084593280869], [3.028718121534957, 41.77055437219666]]], [[[3.024128370924548, 41.77276733460831], [3.02367975227097, 41.772727949834234], [3.024134082413067, 41.772956065906584], [3.024128370924548, 41.77276733460831]]], [[[3.025312085467807, 41.77269605784371], [3.024922434924539, 41.772644522663654], [3.025003157536026, 41.77299133366941], [3.025312085467807, 41.77269605784371]]], [[[3.041289043231392, 41.77814590774545], [3.040677895986426, 41.778169190814026], [3.041439210106071, 41.778336005888434], [3.041289043231392, 41.77814590774545]]], [[[3.046115940991889, 41.779853294053815], [3.046494076929911, 41.77952726184775], [3.045685593172973, 41.779497971728674], [3.046115940991889, 41.779853294053815]]], [[[3.04607118243272, 41.78014368565918], [3.045803933635342, 41.7798607639185], [3.044951801636949, 41.779878777067225], [3.04607118243272, 41.78014368565918]]], [[[3.094870116645166, 41.83461422287013], [3.094288544634337, 41.834321157844784], [3.094149897754865, 41.83450857611518], [3.094870116645166, 41.83461422287013]]], [[[3.095039286481263, 41.8355053689717], [3.094542263006793, 41.835468855228015], [3.094870726601063, 41.835631354111435], [3.095039286481263, 41.8355053689717]]], [[[3.130337473514417, 41.840739370991216], [3.129997817809953, 41.84058653162142], [3.12989188038659, 41.84098827669432], [3.130337473514417, 41.840739370991216]]], [[[3.132932227571738, 41.8460821101083], [3.132977602375106, 41.846178674253096], [3.133238537812751, 41.84613771313917], [3.132932227571738, 41.8460821101083]]], [[[3.137774930292061, 41.847496615045316], [3.13804774055953, 41.84732895012667], [3.137691033034276, 41.847375132736715], [3.137774930292061, 41.847496615045316]]], [[[3.138627897723751, 41.84760387381485], [3.138214681675548, 41.847563020012295], [3.138228508544374, 41.84783234506784], [3.138627897723751, 41.84760387381485]]], [[[3.141494952704528, 41.848125067168624], [3.141139938503626, 41.84818914612219], [3.141520683149206, 41.84826769777529], [3.141494952704528, 41.848125067168624]]], [[[3.142176245796882, 41.84870059771326], [3.142356701168078, 41.848573868763694], [3.142080362318197, 41.84857970990148], [3.142176245796882, 41.84870059771326]]], [[[3.153953606550919, 41.8608674532058], [3.153618134300765, 41.86075948474986], [3.153365880181974, 41.861016082731304], [3.153953606550919, 41.8608674532058]]], [[[3.179480617900064, 41.867214091644534], [3.178929226587867, 41.866991862226946], [3.179088044238697, 41.86738832521329], [3.179480617900064, 41.867214091644534]]], [[[3.179318113563065, 41.8680239812729], [3.178785187121604, 41.86749470505253], [3.178855024846763, 41.867968003917824], [3.179318113563065, 41.8680239812729]]], [[[3.178970837449508, 41.871157180011295], [3.178781581283437, 41.871068413825675], [3.179074722222322, 41.871484604886795], [3.178970837449508, 41.871157180011295]]], [[[3.206437877436233, 41.89987849012297], [3.206662128372569, 41.89983030210569], [3.206789375631157, 41.89965238925071], [3.206437877436233, 41.89987849012297]]], [[[3.209976264989473, 41.90293603205016], [3.209736785812348, 41.90307506102487], [3.210257366706947, 41.90310077515414], [3.209976264989473, 41.90293603205016]]], [[[3.208559397204047, 41.908188870711435], [3.20815099432906, 41.90820204697849], [3.209068930617315, 41.90822420374565], [3.208559397204047, 41.908188870711435]]], [[[3.218684772317658, 41.924174650214084], [3.218015509463488, 41.923986039681616], [3.217778615637732, 41.92415191616219], [3.218684772317658, 41.924174650214084]]], [[[3.218514356517924, 41.92465200394843], [3.217214669470993, 41.92442562588255], [3.217897905619391, 41.92475755123902], [3.218514356517924, 41.92465200394843]]], [[[3.219868632388158, 41.92519045718745], [3.219046312778929, 41.92516319199717], [3.219755036826972, 41.92538568694472], [3.219868632388158, 41.92519045718745]]], [[[3.218789419757774, 41.93760835682902], [3.218031300945398, 41.93762256077767], [3.21839962728047, 41.938061605969985], [3.218789419757774, 41.93760835682902]]], [[[3.228846166262336, 42.04129559921707], [3.228199296611488, 42.041717895229624], [3.229088677253515, 42.04155239212923], [3.228846166262336, 42.04129559921707]]], [[[3.227869448713376, 42.04155583925315], [3.227079870899639, 42.04187791668641], [3.227981295254546, 42.042080818633565], [3.227869448713376, 42.04155583925315]]], [[[3.227310183667112, 42.0439806287825], [3.226044656855676, 42.04289741806702], [3.224444162647002, 42.04320061974069], [3.224437296823084, 42.04399311987541], [3.227310183667112, 42.0439806287825]]], [[[3.225119446009099, 42.04947369019336], [3.227023557309919, 42.047461710095845], [3.2254092056897, 42.04737863387398], [3.223255011498971, 42.04486757700253], [3.219471823147675, 42.048656009249875], [3.223404939421166, 42.048738939714816], [3.224740749522108, 42.05016938497571], [3.225119446009099, 42.04947369019336]]], [[[3.206334238770523, 42.07325898816319], [3.205372798869623, 42.0733111879701], [3.205149015955397, 42.07435845173849], [3.206334238770523, 42.07325898816319]]], [[[3.198441918247691, 42.084479482974324], [3.197721343624408, 42.08440153203975], [3.197616751877271, 42.084938273638514], [3.198441918247691, 42.084479482974324]]], [[[2.030787096920979, 42.127186133712335], [2.031776092641943, 42.12699862883848], [2.030145233582391, 42.12122737787645], [2.020085880161305, 42.121101927167224], [2.021735919150784, 42.11887780873016], [2.017391363702816, 42.109660181844525], [2.015258575469467, 42.108376209192606], [2.007902371317282, 42.107239875171885], [2.006983680445086, 42.11582395113604], [2.004593264371239, 42.11663979006278], [2.003369564917514, 42.1178366572439], [2.004281078250181, 42.11881417420497], [2.00162388589295, 42.12023576892317], [2.006370642246982, 42.121234649929455], [2.006169080958288, 42.12312509888748], [2.002889885216569, 42.125555297896746], [2.011213827356717, 42.12682060609307], [2.01756256642577, 42.12604723072594], [2.01866871323953, 42.1273401601071], [2.022153363568259, 42.127664463969616], [2.020758606917976, 42.131281865043206], [2.02632568592527, 42.13086639779823], [2.027134337666372, 42.1293183706554], [2.030001409711796, 42.12902128981322], [2.030787096920979, 42.127186133712335]]], [[[3.265067487205826, 42.23705989707549], [3.263920292771815, 42.23709576712974], [3.264339623652192, 42.23741482701647], [3.265067487205826, 42.23705989707549]]], [[[3.203945522276004, 42.240142890814845], [3.204079269744033, 42.2399016197084], [3.203385099301908, 42.24011031384255], [3.203945522276004, 42.240142890814845]]], [[[3.199181209241603, 42.24257080421373], [3.198504067264056, 42.24270659405174], [3.199072690958402, 42.242945750962996], [3.199181209241603, 42.24257080421373]]], [[[3.284060292401742, 42.2733895849626], [3.283593765832751, 42.273694307843165], [3.283834873655458, 42.273924082049696], [3.284060292401742, 42.2733895849626]]], [[[3.293786855954586, 42.28097324413405], [3.292064295071543, 42.28096014176174], [3.292765994293819, 42.2825","Cataluña","09","Girona","Gerona","17"]
[null,null,null,null,null,null,null,null,null,null,null,null,"C95",0.189,null,"Cu 1x 70 Mm2",0.26800000000000002,null,null,"37.3125169672, -3.26788107732",{"$cut":{"chars":32767,"head":"{\"coordinates\": [[[[-3.389706288728371, 36.708126400040996], [-3.390098218296913, 36.70814314113807], [-3.389842591903053, 36.70851359117047], [-3.389706288728371, 36.708126400040996]]], [[[-2.549750278027263, 38.08289109868566], [-2.546796063112482, 38.07934670583446], [-2.539304800854172, 38.07573953788942], [-2.531186101302406, 38.07408510405421], [-2.522559579629056, 38.0699405510113], [-2.504397994576957, 38.068324168229104], [-2.491454067240104, 38.05911187487525], [-2.481769437061506, 38.05525714479432], [-2.480701741735669, 38.053116370254145], [-2.478399536630542, 38.05308815966228], [-2.471639697947914, 38.05638368393547], [-2.462349733606212, 38.050185798897225], [-2.458538269890616, 38.050826215699615], [-2.436096387681147, 38.04341123073661], [-2.432108177738476, 38.04333793471718], [-2.423408481098625, 38.03370593322253], [-2.411547218613577, 38.03217801525717], [-2.403325821861967, 38.03290262774848], [-2.397191820573131, 38.03195196212402], [-2.373074972024221, 38.02328151611548], [-2.357917877898326, 38.022442526243424], [-2.352351589411167, 38.024466887021944], [-2.34162800460592, 38.02600251199907], [-2.323087123891387, 38.013982057735284], [-2.312106392742793, 38.010222969899026], [-2.298468548289987, 38.00212080364868], [-2.299181992983588, 38.00016024210043], [-2.297225749755694, 37.98912581022358], [-2.280078917818221, 37.96311882884113], [-2.266803998130104, 37.95293314508539], [-2.258821024136353, 37.949926761709236], [-2.253417031576618, 37.939563711696316], [-2.247153300984331, 37.934431405077234], [-2.24105899355294, 37.93172436485503], [-2.237906136874416, 37.928495344565], [-2.229556334037724, 37.92611547566468], [-2.227704784066286, 37.92364279926508], [-2.222829873157784, 37.92413335581112], [-2.220071041817363, 37.92141119456879], [-2.207664625922346, 37.91656929115575], [-2.250774197892198, 37.89717719917276], [-2.265379959995602, 37.88094711658197], [-2.278548830869446, 37.88434553123233], [-2.288514288778922, 37.88513638482087], [-2.29494376932089, 37.876315522661336], [-2.296365762889814, 37.86546348296626], [-2.294861754033734, 37.847888201841094], [-2.293842157203168, 37.84156403105635], [-2.290879581668109, 37.837607473717576], [-2.289381349877648, 37.831478632596195], [-2.293560976434352, 37.828124007601616], [-2.301769747364702, 37.80828151559791], [-2.300224479785973, 37.80348643187455], [-2.29127331415545, 37.789192307011405], [-2.285489210263019, 37.785993749812036], [-2.276780838592476, 37.77621545281457], [-2.28706991637965, 37.75140246407595], [-2.288743318752181, 37.75208858163775], [-2.294717313020908, 37.748167864650554], [-2.294271328228473, 37.74611923603701], [-2.297197023429555, 37.744000617882826], [-2.296891509994669, 37.74149319357694], [-2.307514035228795, 37.72326872611548], [-2.30807279721696, 37.72052304109806], [-2.305022252361072, 37.71913506263294], [-2.307949339052547, 37.716709756177046], [-2.306591531009028, 37.710212441073935], [-2.313274441563996, 37.71136918008839], [-2.323337490649233, 37.69386988397911], [-2.325660660636483, 37.68154427174463], [-2.325792127281652, 37.672009170647826], [-2.321128975336739, 37.6598326120943], [-2.319509631781405, 37.65962500415733], [-2.319954803598528, 37.64809070470778], [-2.316548818740909, 37.64495246985641], [-2.315470275359654, 37.64143102621341], [-2.308858367644752, 37.63571415796805], [-2.310418443052554, 37.63000891868823], [-2.316703531989021, 37.621834512039406], [-2.34042918309634, 37.62342078164616], [-2.345432453377494, 37.629217079609326], [-2.356469677777676, 37.625366163591806], [-2.359564503288894, 37.621263975697715], [-2.363766681152459, 37.62146702471132], [-2.373877606849124, 37.62920943725269], [-2.381567386903805, 37.629826884061], [-2.391269500992771, 37.632482212764565], [-2.389778097296773, 37.62913955895637], [-2.388792477445154, 37.6180031206877], [-2.380320210879074, 37.612136294567485], [-2.375979735580867, 37.61225760472292], [-2.367894969889039, 37.59157413399242], [-2.367931280691079, 37.58861797068369], [-2.369936367117643, 37.5858976572339], [-2.369807651113868, 37.581011760025504"}},"Andalucía","01","Granada","Granada","18"]
[null,null,null,null,null,null,null,null,null,null,null,null,"AL 1x 95 Mm2",0.32,null,"Cu 1x 95 Mm2",0.193,null,null,"40.8134495654, -2.62368878371",{"$cut":{"chars":32767,"head":"{\"coordinates\": [[[[-3.374050970979573, 40.64024845491084], [-3.372667030046133, 40.63892589567058], [-3.363607849189231, 40.63842049578576], [-3.363666660094214, 40.63160154987006], [-3.368162779295201, 40.63252516273952], [-3.369378016618306, 40.62794302998204], [-3.371730799568815, 40.62576795191181], [-3.374444036916983, 40.62613668375259], [-3.376791546756793, 40.62874523867441], [-3.382136529883831, 40.63047004070051], [-3.380258098725825, 40.63285365977347], [-3.372260719348202, 40.63561106719775], [-3.374846515401933, 40.63848554574961], [-3.374050970979573, 40.64024845491084]]], [[[-2.901017856789488, 41.325564213091575], [-2.897936125121872, 41.32480488266325], [-2.888423791814757, 41.32523750325701], [-2.882706356391205, 41.3217548538698], [-2.875454241831156, 41.32137794510415], [-2.868986788603766, 41.31705608599474], [-2.866844267125253, 41.31307220223328], [-2.869816719636887, 41.308301480175935], [-2.873037283236686, 41.2985046592336], [-2.865896351362721, 41.29178577479699], [-2.864102153432261, 41.28735185491597], [-2.863696857830599, 41.281280135161175], [-2.866887038610836, 41.274464957745295], [-2.859010063125677, 41.27287025773852], [-2.855158803144683, 41.27050545269596], [-2.832456032210393, 41.26358377915698], [-2.821761858247563, 41.25837025503082], [-2.822244108926377, 41.25661449585313], [-2.819592100747953, 41.25734005379791], [-2.810679919305814, 41.25573137691475], [-2.803539454555773, 41.25651213267084], [-2.79400886478716, 41.25433361200219], [-2.783208057206843, 41.25386340583093], [-2.77551015638195, 41.25008346194582], [-2.776282527863235, 41.25806583868949], [-2.769349977287412, 41.26741130910331], [-2.760944796008459, 41.27402389786435], [-2.730089753683666, 41.27166781116005], [-2.71677180469349, 41.275671323204435], [-2.714065319981264, 41.261117088735276], [-2.70954570175076, 41.25198085685244], [-2.691396202632487, 41.2433221960335], [-2.673609984910085, 41.239372798132926], [-2.67025569001217, 41.237192354218195], [-2.65483177468737, 41.24065116485856], [-2.646015114702572, 41.2402100819337], [-2.645120551681421, 41.23791937081128], [-2.634700476169654, 41.231932585678564], [-2.636248983073238, 41.22381243568015], [-2.629198965197609, 41.21521453087091], [-2.623901139131435, 41.22373673605963], [-2.616970713969552, 41.21943514720772], [-2.589488095443378, 41.22453786465002], [-2.587006575827798, 41.21695343612076], [-2.58742037757688, 41.21375712478966], [-2.593743229891259, 41.2002048470157], [-2.603107350159626, 41.19398611186883], [-2.620009366029371, 41.195367341070174], [-2.622067414430151, 41.18798766212975], [-2.619340221754041, 41.183285594135626], [-2.602567271332705, 41.188660589603714], [-2.584340217961017, 41.182191613076256], [-2.577495227972568, 41.1786626097047], [-2.582629493283426, 41.164358781246406], [-2.587416013561251, 41.15951177975633], [-2.593462983370411, 41.15693906665686], [-2.595951534998007, 41.15346175121846], [-2.595315826017597, 41.15025270375621], [-2.581301653936051, 41.14080727192806], [-2.575578836705592, 41.13947114179007], [-2.56759537223173, 41.14491824473294], [-2.555154630811429, 41.14668135264825], [-2.542530856753621, 41.15066736304158], [-2.539566712760049, 41.15360114073919], [-2.539352392699573, 41.15866272279662], [-2.536512334792885, 41.16252468761942], [-2.517357946061815, 41.147871025976805], [-2.517402380329015, 41.13695365705613], [-2.511628339364421, 41.13149751682572], [-2.50885154081995, 41.118856487201434], [-2.503704238259429, 41.11747419096981], [-2.487246865099108, 41.116915570718135], [-2.484464520356126, 41.117812926113764], [-2.482261065253578, 41.11627164976552], [-2.477845015588814, 41.10989210718367], [-2.475983542826781, 41.10135303465291], [-2.469443226348351, 41.08983784384265], [-2.469466279813481, 41.07810950217053], [-2.449518216952463, 41.07766446570045], [-2.447934566158326, 41.07487339218958], [-2.442271699794967, 41.077296296057696], [-2.440008757355998, 41.07322265981828], [-2.440953009788819, 41.07136257473211], [-2.438232067590449, 41.07079082811698], [-2.429744197287858, 41.0722894307471], [-2.4297997"}},"Castilla - La Mancha","08","Guadalajara","Guadalajara","19"]
[null,null,null,null,null,null,null,null,null,null,null,null,"AL 1x150 Mm2",0.20599999999999999,null,"Cu 1x 120 Mm2",0.153,null,null,"37.5771794021, -6.82930221031",{"$cut":{"chars":32767,"head":"{\"coordinates\": [[[-6.927226499279804, 38.2044355290884], [-6.924324029121681, 38.20523530785761], [-6.925399928761217, 38.20188420594708], [-6.92169803615351, 38.20012458820323], [-6.918197835090027, 38.201260971753825], [-6.913814837138854, 38.19976833589311], [-6.90280567341158, 38.201802109889094], [-6.898740765309296, 38.19856647588657], [-6.89474387584369, 38.19810731165456], [-6.892785020314663, 38.19540484492288], [-6.883622761370813, 38.193527758653936], [-6.860115967711279, 38.18044966890171], [-6.848751345117736, 38.177232053173505], [-6.8226921314103, 38.17381354456352], [-6.812404103752394, 38.1758793511849], [-6.806044735819184, 38.178653039202786], [-6.79504285832736, 38.178394452143294], [-6.792869925283014, 38.1733163080979], [-6.792861507170471, 38.16633551477984], [-6.794260140948962, 38.159867701695525], [-6.798902637931107, 38.15524057460386], [-6.799540394172299, 38.14379798292772], [-6.80913863516787, 38.134704180989814], [-6.813373487453909, 38.12382930209067], [-6.816123935716475, 38.12015478879838], [-6.812636161048415, 38.11514267209176], [-6.807820376353004, 38.11111035604472], [-6.799951136259707, 38.114797345238514], [-6.79782825644463, 38.113875201214974], [-6.796876702505118, 38.11047396361223], [-6.789159476222573, 38.10917397825922], [-6.783338689624785, 38.11192000607413], [-6.780349992877546, 38.10901662709086], [-6.7748592886377, 38.11264337668088], [-6.770054883800322, 38.1121131701342], [-6.769623192102259, 38.1103704936831], [-6.773638908459464, 38.10466550005075], [-6.771362712276557, 38.103189286929066], [-6.764929404910659, 38.10599913078173], [-6.764573884958838, 38.102407326665165], [-6.770087691172828, 38.09945593021168], [-6.761023872312985, 38.0978729677396], [-6.758217264073886, 38.09271117463912], [-6.754493780458408, 38.09501025215998], [-6.747678478891014, 38.0914626361278], [-6.742244729636892, 38.093311489765945], [-6.731991322151802, 38.09005265997667], [-6.730460241666226, 38.092443437035875], [-6.735164293906543, 38.09394228470283], [-6.729394656482784, 38.09950358020763], [-6.727125323428639, 38.099710786106186], [-6.726863883138206, 38.0974850919515], [-6.724167505371006, 38.09691304157053], [-6.71975043432127, 38.1006203068081], [-6.71696785511769, 38.09992474600462], [-6.71504077479694, 38.09249098272802], [-6.706901502926024, 38.0965316391712], [-6.691820461068787, 38.09494398414996], [-6.690169011724964, 38.099725249658476], [-6.688666894720792, 38.10023182988085], [-6.684866968067989, 38.09720730426496], [-6.68193458580762, 38.09647056013917], [-6.68002218575525, 38.097431344690854], [-6.67679674070983, 38.095397478661745], [-6.673568493819088, 38.095804852784134], [-6.672500847002114, 38.094288828571955], [-6.666378000991811, 38.09425499222486], [-6.660367960025052, 38.09237065320399], [-6.658912707230943, 38.09290244316033], [-6.658711194451414, 38.09525989557795], [-6.653026979624743, 38.09648186285337], [-6.650119831939102, 38.09532916081609], [-6.65151636725297, 38.09270036481843], [-6.649297100902902, 38.090021837782984], [-6.646166890752331, 38.09125415757336], [-6.642056305114703, 38.097534425041914], [-6.636893411393562, 38.0962100210652], [-6.631798773464338, 38.09660649587454], [-6.628252551709053, 38.09842772826728], [-6.624460415246386, 38.09666214825994], [-6.622425445463444, 38.097004207100134], [-6.612781410151698, 38.085896832189746], [-6.607713533034835, 38.08343124877819], [-6.604496103656714, 38.07733231175343], [-6.598835243230899, 38.073911563093766], [-6.595116873724472, 38.06978475891894], [-6.5943169958291, 38.06686374074454], [-6.588359994990046, 38.06201919197237], [-6.587375663322488, 38.0591305401061], [-6.580525694870098, 38.05277239212927], [-6.580513584681798, 38.05042157265738], [-6.584461066806537, 38.04423843692398], [-6.583848383443382, 38.03424871275966], [-6.587173953812007, 38.026778254784965], [-6.584739504120462, 38.02660029786164], [-6.586114555325994, 38.02373870518995], [-6.583580666624107, 38.02128458681409], [-6.57906780462245, 38.02215191578578], [-6.576282764035053, 38.02061517405933], [-6.572153003857716, 38.0"}},"Andalucía","01","Huelva","Huelva","21"]
[null,null,null,null,null,null,null,null,null,null,null,null,"AL 1x240 Mm2",0.125,null,"Cu 1x 150 Mm2",0.124,null,null,"42.2030557371, -0.0728865943582",{"$cut":{"chars":32767,"head":"{\"coordinates\": [[[-0.747266240683383, 42.92237539781395], [-0.744122848654665, 42.919206857916045], [-0.734675079063574, 42.91958749896106], [-0.732990755872169, 42.9184105911319], [-0.727613809789004, 42.9193192369204], [-0.733392435754854, 42.914474521002795], [-0.734128472179556, 42.91244503523229], [-0.73198797101213, 42.90100267703401], [-0.733041597822342, 42.897988984628114], [-0.727739623336102, 42.89462412287868], [-0.72786790275869, 42.892465551927884], [-0.723939019353948, 42.89240552275723], [-0.723667985954631, 42.88945555976905], [-0.719980858057472, 42.8881575677137], [-0.717580488651393, 42.88584052024562], [-0.711731417699316, 42.88539956305453], [-0.708756225326071, 42.883737241108825], [-0.704346314747931, 42.88411707107888], [-0.7001564779397, 42.88153865122094], [-0.698428282826359, 42.878955578844575], [-0.680550734287244, 42.88291693806948], [-0.678762135555982, 42.88457357470101], [-0.676109285656087, 42.88054865806455], [-0.673115676921218, 42.879731455214134], [-0.669693157672466, 42.87697842121483], [-0.666527200862132, 42.87651767918207], [-0.662010367408987, 42.86936587192718], [-0.662043749703279, 42.86459404570003], [-0.65621574514286, 42.8588109080721], [-0.648743508303842, 42.855100770797264], [-0.642296719921298, 42.85341034688412], [-0.636003897388452, 42.85314547887723], [-0.632456012851933, 42.85119013690469], [-0.630330247648431, 42.84725610104867], [-0.619957472927845, 42.837901095910425], [-0.602140401668619, 42.83194628064514], [-0.6013354635633, 42.8299844102307], [-0.604223858917165, 42.82805486325511], [-0.604149938349079, 42.826486477183686], [-0.601398105782972, 42.824889034668004], [-0.602072889681746, 42.820409824761], [-0.598475718178821, 42.81538180276918], [-0.601144696431262, 42.80582973111664], [-0.600405553632331, 42.80249151691776], [-0.591974304142078, 42.802323419983935], [-0.587133366619256, 42.80511199363371], [-0.581545896755945, 42.80445380303394], [-0.576551187419412, 42.808346269005554], [-0.568371736601637, 42.80641686588358], [-0.564715007693665, 42.79956755300196], [-0.570463023566224, 42.79080201369671], [-0.570201789888368, 42.784358086175914], [-0.567518553575726, 42.781077368890756], [-0.562733395143824, 42.78246139222785], [-0.556727422647557, 42.781621979235915], [-0.553163262434631, 42.78055530277172], [-0.551076903627705, 42.77766517717744], [-0.548777279382401, 42.78606240096155], [-0.545616610954162, 42.789011292637], [-0.544156762379168, 42.79284300494118], [-0.540788127674439, 42.793310944700956], [-0.529707746411274, 42.79154156896836], [-0.522735628640401, 42.79928801994247], [-0.523469780399654, 42.80142001225048], [-0.52542073255051, 42.80247974615311], [-0.524718717122302, 42.80597640971691], [-0.526265290851408, 42.80920652363868], [-0.525247581381184, 42.81202999766508], [-0.522337447695766, 42.81293053676781], [-0.522205213889362, 42.81440444471222], [-0.519229151048566, 42.815114377724115], [-0.518336172655559, 42.81694998689724], [-0.513888310053286, 42.818366257781584], [-0.51335647865901, 42.82186653801105], [-0.510949709654798, 42.82453362192337], [-0.505496678962011, 42.82719736118748], [-0.501282643336626, 42.827339567708634], [-0.498551039034142, 42.820454317189714], [-0.493810743365831, 42.816982858777365], [-0.486574520003107, 42.81656302110042], [-0.483382112299192, 42.81535832215459], [-0.48009911758374, 42.81277375001805], [-0.478586035743364, 42.809678821634755], [-0.466778904838939, 42.80679772186112], [-0.461429281913407, 42.804238919718614], [-0.452674240967159, 42.80362114992105], [-0.444952539278845, 42.79602918583921], [-0.440511871283655, 42.7954886888937], [-0.439638807642161, 42.797090068034386], [-0.436021052142826, 42.79853083899701], [-0.430318374242628, 42.79893419818087], [-0.426686023814857, 42.802193312978424], [-0.416491031078888, 42.80651101276408], [-0.414595604694014, 42.80533359175545], [-0.40519368601338, 42.80615631094929], [-0.394308320015271, 42.80210901897895], [-0.392557840394741, 42.80011515390383], [-0.384878336168528, 42.80128161507397], [-0.385079115024423, 42.80522126079691], [-0.3829201588"}},"Aragón","02","Huesca","Huesca","22"]
[null,null,null,null,null,null,null,null,null,null,null,null,"AL 1x400 Mm2",0.10199999999999999,null,"Cu 1x 185 Mm2",9.9099999999999994E-2,null,null,"39.5751889864, 2.91229172079",{"$cut":{"chars":32767,"head":"{\"coordinates\": [[[[4.093964552869251, 40.088360676919], [4.094500501272325, 40.08470236895149], [4.097364040258374, 40.08476086805355], [4.097739751621564, 40.086198807566085], [4.09909851997564, 40.086041761175544], [4.099331791804056, 40.08472871776474], [4.094482491824987, 40.08060333196421], [4.096919481075602, 40.07775138966706], [4.092472755734507, 40.07474374296348], [4.094352669121811, 40.073730493037964], [4.092729310071908, 40.070295269108904], [4.096379092332183, 40.06942292905277], [4.096431869247711, 40.06644935519949], [4.095222085586204, 40.06408235518605], [4.092239413833932, 40.062979827660776], [4.093834292675786, 40.06074851500912], [4.092914958624783, 40.059531915997034], [4.0946977982476, 40.0593934661592], [4.094125338756919, 40.058191627606924], [4.095985962613696, 40.056917239677496], [4.09896478600011, 40.05801971404672], [4.098790053802113, 40.05430503466526], [4.100575349412975, 40.05459891575038], [4.098939521777035, 40.05042508616381], [4.102184002145947, 40.047975319779546], [4.10240677624476, 40.04506767723126], [4.104348576387947, 40.044314949623846], [4.102816803284616, 40.044095259207076], [4.103680190289199, 40.042663578879896], [4.102094395213101, 40.040318234943996], [4.103264059194061, 40.03857281113352], [4.10501197412973, 40.039844480880674], [4.105352682676936, 40.0376249645868], [4.107358983642574, 40.03684451781209], [4.106532463495998, 40.04317692912421], [4.104417229225104, 40.044300785693515], [4.108089231307141, 40.04525674496303], [4.107365372427106, 40.04982686959152], [4.108177181760301, 40.049418217605925], [4.107933335886647, 40.05078544073112], [4.109516812390184, 40.05119824674346], [4.109799134039281, 40.054420866612716], [4.111944192374636, 40.05421564568545], [4.113422412392976, 40.05544922820677], [4.119233036387855, 40.05553741919017], [4.119384322553527, 40.0544818801279], [4.125042446747377, 40.05501269568037], [4.124894085491616, 40.05971697163677], [4.126365432477563, 40.06255864065452], [4.128444081057362, 40.06151135965178], [4.129670930016243, 40.06342739114741], [4.132817501200462, 40.06363543883372], [4.13352381506667, 40.057128320909506], [4.131435079322823, 40.055333376707964], [4.13191179458072, 40.054297145803034], [4.130298331375601, 40.05518677586257], [4.130081968550015, 40.051711305796395], [4.124580473730151, 40.04272848167316], [4.123838401545238, 40.037019262029226], [4.119970636780745, 40.035862949123704], [4.121637540740443, 40.033693622720236], [4.120923202235692, 40.03202931466604], [4.123107597777924, 40.03185498755501], [4.122524794180672, 40.029905624057896], [4.124858804157579, 40.02970280218058], [4.124621158430299, 40.028254603926655], [4.127308625818776, 40.026034731077836], [4.129057529831517, 40.02869348421156], [4.129815200371916, 40.0271995731276], [4.132299157148337, 40.02836454110247], [4.133387900891835, 40.03011074690651], [4.130165459787262, 40.03120529006931], [4.134330535473642, 40.03537198098939], [4.13701016144953, 40.03598989469952], [4.133553877202974, 40.03248307508363], [4.137386365108313, 40.03460325123861], [4.136550431543539, 40.03243118922137], [4.139647525308829, 40.0328783101774], [4.140917422423641, 40.03923537920745], [4.139442916918464, 40.04166889777666], [4.141276167317755, 40.0428716301444], [4.140486865315005, 40.044086656703776], [4.141564190581446, 40.04503103200832], [4.140615968459715, 40.048229640766216], [4.142573419933068, 40.04878694475004], [4.138820321542502, 40.054049298571805], [4.142911128106356, 40.05549555321697], [4.140473747207328, 40.055699751960155], [4.140837390611579, 40.057029557104265], [4.139013236551492, 40.05780427572778], [4.13960065481614, 40.059239966213845], [4.138370819844876, 40.05913943777634], [4.138854152117103, 40.0604410526646], [4.137308305998684, 40.06099226974929], [4.138403602060275, 40.061328403783946], [4.137052520602324, 40.06262097107108], [4.138115466532547, 40.06347991275312], [4.136454252502395, 40.063617849640096], [4.138199775223155, 40.064271889239045], [4.136545268914607, 40.067022447227316], [4.13902960565518, 40.067236810075194], [4.141510465014294,"}},"Illes Balears","04","Illes Balears","Islas Baleares","07"]
[null,null,null,null,null,null,null,null,null,null,null,null,null,null,null,"Cu 1x 240 Mm2",7.5399999999999995E-2,null,null,"38.0165122783, -3.44169215171",{"$cut":{"chars":32767,"head":"{\"coordinates\": [[[-2.766827131575509, 38.53296916076714], [-2.763605935561701, 38.53209756203379], [-2.762077806042015, 38.532752340907884], [-2.754589172254204, 38.52835702905373], [-2.753782990880529, 38.52592207581224], [-2.747898859581231, 38.52556711483046], [-2.739031336985079, 38.522240250989775], [-2.733346736781711, 38.51461223302401], [-2.728103377367836, 38.51190554018869], [-2.709844353853493, 38.505868775190855], [-2.70251238175962, 38.501091986019105], [-2.679697122887168, 38.49692239579815], [-2.672726136993603, 38.496623718882454], [-2.664993334823293, 38.49983719162996], [-2.664057945169076, 38.501222385936885], [-2.658182089150154, 38.50205251480177], [-2.643980428787436, 38.507399421203814], [-2.636214965670053, 38.50751974689497], [-2.618605478005086, 38.51256454379368], [-2.599746424796662, 38.51291616263399], [-2.592704041702614, 38.51081912987598], [-2.587538972262348, 38.50744856066825], [-2.585130418305762, 38.50347476496446], [-2.579558500975018, 38.503148476850654], [-2.566629334754924, 38.490466538830006], [-2.572608442234286, 38.48770377997379], [-2.575721261898924, 38.48289367971474], [-2.576797452592443, 38.477319134732355], [-2.573319897159526, 38.468276529170495], [-2.567404810813841, 38.460657665219514], [-2.566966680890231, 38.45346440398137], [-2.571000188381151, 38.4439625196005], [-2.568961250739721, 38.441909299587095], [-2.571884539354197, 38.4378645887596], [-2.576981605429062, 38.4342872751568], [-2.575316228605339, 38.43107297801636], [-2.577205998298816, 38.42728570506659], [-2.576841196953581, 38.423075733660504], [-2.571888034698938, 38.41412678318492], [-2.561305713565369, 38.41195178907062], [-2.558048090866822, 38.408965580096314], [-2.558155831208739, 38.406334471863396], [-2.554848419385517, 38.40405087571782], [-2.550673896157946, 38.403115739605575], [-2.545573350907919, 38.40556542860764], [-2.534917347259807, 38.40625363392127], [-2.53136369104759, 38.40497778386935], [-2.520922847384756, 38.40429575000919], [-2.515259619000315, 38.39999179195595], [-2.49632003721659, 38.39958754263954], [-2.483402758402667, 38.397855145884606], [-2.482361128593081, 38.396192362638466], [-2.48294143397839, 38.393509277088185], [-2.481593433741181, 38.39307978014646], [-2.492384661687341, 38.37129955066473], [-2.490033351075528, 38.36544948209369], [-2.490918610245344, 38.363272379699616], [-2.486038687635866, 38.354130824981695], [-2.478958118955703, 38.348809422589156], [-2.481242622758105, 38.33345376376248], [-2.480194244804117, 38.32807782526204], [-2.481043917213879, 38.32445863610966], [-2.484758374556933, 38.32014912282465], [-2.485208567058179, 38.300251948092516], [-2.484689166550816, 38.30091660314559], [-2.481483865327687, 38.29494535995243], [-2.473691717754795, 38.29239622911064], [-2.446499292794601, 38.287783095072314], [-2.441370302391098, 38.28562290897186], [-2.439083693835993, 38.27375178090959], [-2.436604008580189, 38.27212670108927], [-2.435390293901514, 38.265019107217775], [-2.437142738137549, 38.26308985717211], [-2.436458758185297, 38.25990519080868], [-2.440206278022391, 38.26011237062848], [-2.439809666434501, 38.258181829920005], [-2.44426205295256, 38.251398613193196], [-2.442737550829948, 38.24750704275295], [-2.44632537895558, 38.24458593596597], [-2.443413976848978, 38.24423872169644], [-2.442238782828009, 38.24250276164094], [-2.442589908221436, 38.23545670462685], [-2.440600473142115, 38.23264437004085], [-2.442861943242271, 38.23126722285796], [-2.450154090324661, 38.22034243083274], [-2.4532565811602, 38.21946469064166], [-2.454337392787526, 38.21548617325971], [-2.452992802555094, 38.21046896597446], [-2.447301930314453, 38.20778361807258], [-2.445576025905142, 38.20493655278941], [-2.447576651297962, 38.19112072884556], [-2.44627411839051, 38.185193361783575], [-2.449459648592615, 38.182198137899434], [-2.455699763374387, 38.17988393463888], [-2.457964562631022, 38.17625331900089], [-2.4631707641315, 38.17314989260673], [-2.467083160755845, 38.17363634719805], [-2.468459177650192, 38.172804415778906], [-2.468493302851171, 38.164981645755574], ["}},"Andalucía","01","Jaén","Jaén","23"]
[null,null,null,null,null,null,null,null,null,null,null,null,null,null,null,"Cu 1x 300 Mm2",6.0100000000000001E-2,null,null,"42.2748706958, -2.5170441194",{"$cut":{"chars":32767,"head":"{\"coordinates\": [[[-2.997229851864886, 42.64213967571064], [-2.989947500910714, 42.64232829876815], [-2.985960260250174, 42.63633000679159], [-2.980569527722298, 42.6352214531629], [-2.975884311357389, 42.63915605108369], [-2.970394388652565, 42.641099936076735], [-2.952636178604035, 42.638563172644325], [-2.946451381179103, 42.63931686423797], [-2.933466144813979, 42.63450079567673], [-2.925842349610132, 42.62517505613754], [-2.926052272417353, 42.62304979522349], [-2.916008873080604, 42.61952147491463], [-2.904435976988258, 42.62016074099493], [-2.905393679895802, 42.623799842249014], [-2.904462709952793, 42.626491809615295], [-2.892753288801922, 42.62770613120897], [-2.890476303000165, 42.62573164510445], [-2.893996020860961, 42.62133114095688], [-2.88214449431695, 42.62072508964094], [-2.880277303778063, 42.61883665282179], [-2.883527560291303, 42.624428464800665], [-2.876295215854043, 42.63100345721554], [-2.864081857795081, 42.633257812145494], [-2.859598565638015, 42.63648598711164], [-2.858094247761545, 42.63820369365005], [-2.856386262945552, 42.63746257181062], [-2.842894180029048, 42.62960282306295], [-2.843080307362689, 42.62345945287856], [-2.848083053027743, 42.61718186411676], [-2.844432290729919, 42.614320379647424], [-2.841801240247066, 42.60859921526357], [-2.834350627653646, 42.60918291079565], [-2.819900117787494, 42.61450142495136], [-2.81877136576843, 42.6127164711341], [-2.823643784750369, 42.60145783719996], [-2.818992289344584, 42.59964825225967], [-2.818183102207984, 42.59711685465899], [-2.819477476615994, 42.59214037408493], [-2.822350587135283, 42.58905477813573], [-2.84084758155496, 42.58119306762761], [-2.837668929752999, 42.571129005660474], [-2.828502631086628, 42.56369581589888], [-2.824995419571265, 42.554944360663825], [-2.820097108447831, 42.55497295975917], [-2.81743369256367, 42.55766151197591], [-2.817601791607843, 42.56264200124521], [-2.814902912032817, 42.56893274210817], [-2.810650705194452, 42.56894382815076], [-2.803488140990073, 42.56459978976805], [-2.800253493603244, 42.566521386754935], [-2.798329308552859, 42.573785783941865], [-2.78937054497163, 42.578245459978874], [-2.781226616235176, 42.579346796711874], [-2.777953688040831, 42.581339749239525], [-2.778987461184941, 42.58534039303838], [-2.773417604589474, 42.592128837170335], [-2.771866656064885, 42.596277465872895], [-2.772550258724775, 42.60265495412048], [-2.774368268298453, 42.60557648414118], [-2.763720798645489, 42.622837108020896], [-2.760439399338005, 42.61997538104127], [-2.75661429021322, 42.61900365166153], [-2.749425452083503, 42.62372513725185], [-2.740772197445557, 42.622553029960734], [-2.736189356683644, 42.619156298130314], [-2.730574719071236, 42.617621158698284], [-2.72816577973738, 42.613607829901575], [-2.721813145576354, 42.608216008068425], [-2.709728366078991, 42.60099915687045], [-2.686158134295601, 42.59509189372662], [-2.681579247917627, 42.59562408466964], [-2.680542007276506, 42.59451797583135], [-2.684978646327563, 42.58729856966539], [-2.68636041782964, 42.58154758888405], [-2.687079361111082, 42.55971022603985], [-2.691504820628435, 42.54180063973474], [-2.705687379215015, 42.517162123243246], [-2.699710980156218, 42.51695737510664], [-2.686329401697833, 42.51989332803091], [-2.679338378881799, 42.525214363049756], [-2.675780520350668, 42.52572670206566], [-2.677346692624337, 42.51011495996823], [-2.674893955928772, 42.50894622369857], [-2.665796570621109, 42.50984760395173], [-2.662102363999513, 42.506431981844976], [-2.656540997381829, 42.504047440881045], [-2.64985382342247, 42.4854565327286], [-2.647748750013223, 42.483263294166996], [-2.639528629767602, 42.48452387269041], [-2.630966042091312, 42.49019837980975], [-2.630458443650102, 42.49373436723464], [-2.628585296382652, 42.49560265025701], [-2.619145046588895, 42.495022799627954], [-2.610170970325318, 42.495873465057095], [-2.605425156306257, 42.50352230984713], [-2.592400905210011, 42.49250754209986], [-2.593769876617538, 42.48971158310314], [-2.598281041701251, 42.48833162785822], [-2.602140391909716, 42.482266141996504], ["}},"Rioja, La","17","La Rioja","La Rioja","26"]
[null,null,null,null,null,null,null,null,null,null,null,null,null,null,null,"Cu 1x 400 Mm2",4.7E-2,null,null,"28.3624928216, -14.5509933924","{\"coordinates\": [[[[-15.41958271571381, 28.18095578888277], [-15.418729767775655, 28.178730993540253], [-15.416595720407576, 28.17910987220646], [-15.414858577563184, 28.177490309683876], [-15.413146661243267, 28.17786108891219], [-15.41385453120976, 28.179231031362995], [-15.412779950877248, 28.178031425729408], [-15.407003578064138, 28.178145773937608], [-15.403537979971494, 28.173475558049354], [-15.405756309939976, 28.169131541368873], [-15.40425532617595, 28.168093376030214], [-15.40526912643381, 28.16604802496928], [-15.401181040661674, 28.16649336202856], [-15.40242696475279, 28.164287142009286], [-15.405320083367677, 28.16495561450073], [-15.40658654830576, 28.1600524911777], [-15.407119502371161, 28.132900015393837], [-15.404326888176534, 28.13078919412198], [-15.40445809337896, 28.125731419208176], [-15.404664357473633, 28.130668583881747], [-15.407637868164244, 28.1328894523789], [-15.406898506321117, 28.15853502216519], [-15.408672344416326, 28.15736301301492], [-15.408583079659214, 28.15438890704131], [-15.410244917586812, 28.15441326177489], [-15.410324142679595, 28.15081352370765], [-15.41089817441326, 28.15236894507058], [-15.410927923009309, 28.15081848114065], [-15.41227560742049, 28.151024299681133], [-15.415853254096195, 28.147298921393467], [-15.412722128547975, 28.14487335882786], [-15.41501544005465, 28.1432167419943], [-15.411736909010497, 28.140658457184024], [-15.415192778320533, 28.14315527037576], [-15.415974949733727, 28.142475859552906], [-15.414979863907304, 28.13184060189177], [-15.412375445964988, 28.13329501689485], [-15.417597351413821, 28.128266974782896], [-15.4172887524284, 28.14627676055731], [-15.420154842527703, 28.14665165173931], [-15.420247561199167, 28.141700076605638], [-15.42127753026879, 28.141730747443276], [-15.421190273366044, 28.147415765371534], [-15.422527582231913, 28.147407138801466], [-15.422725903328624, 28.145634969117513], [-15.42275062769154, 28.14739513643887], [-15.424100979202104, 28.14746772236881], [-15.42420129583135, 28.14288169102191], [-15.425228949942099, 28.142883016975734], [-15.425166870103764, 28.146746745058458], [-15.427650085543183, 28.146793183960064], [-15.427757961505536, 28.142782636544386], [-15.425803918576214, 28.141256386937016], [-15.423770189694508, 28.141535749485367], [-15.422461765241026, 28.13972312029786], [-15.42511256685174, 28.141138922162025], [-15.428480357179234, 28.140058726333702], [-15.428692774616364, 28.13634349455479], [-15.42695891333629, 28.136220270180797], [-15.426981707208935, 28.13723570411474], [-15.426394681348985, 28.136375470158608], [-15.426408143518325, 28.13728940258493], [-15.425692298312237, 28.13644535524597], [-15.425348533652665, 28.139005575407293], [-15.424805768647342, 28.13451859003603], [-15.427871764483168, 28.13370337980652], [-15.429364471091535, 28.128889585510642], [-15.425802634700673, 28.12813339829739], [-15.427985900773425, 28.12734576999925], [-15.425959838109645, 28.127164766086796], [-15.427465609874774, 28.12637023034602], [-15.425987833206145, 28.126523761924744], [-15.427116802029214, 28.125872567304423], [-15.426002075095878, 28.126180705865455], [-15.426839090470297, 28.125496551214308], [-15.425434281273564, 28.125336195499415], [-15.425278227668565, 28.123447759466707], [-15.42461792628209, 28.12771959241707], [-15.424105889037826, 28.12179722251891], [-15.422894990223917, 28.120938863566934], [-15.422753663649354, 28.122302404112077], [-15.421251192246899, 28.119540218679326], [-15.421042647416519, 28.120964900116114], [-15.414470951692525, 28.110721204680594], [-15.410781981078221, 28.1009492394236], [-15.412305208778186, 28.09097431463078], [-15.41565188056501, 28.087585831088084], [-15.416445642003625, 28.083995166171587], [-15.413301161113253, 28.07551924435562], [-15.414555859091847, 28.076104469355407], [-15.414952739345933, 28.073189798154278], [-15.41716102437889, 28.070921831909146], [-15.416933669652972, 28.067627618662936], [-15.419978024077915, 28.06081647106134], [-15.417298397269569, 28.05576495219394], [-15.414503197737204, 28.054918075517744], [-15.413255430241914, 28.052843361092492], [-15.416115002981721, 28.047876601","Canarias","05","Las Palmas","Las Palmas","35"]
[null,null,null,null,null,null,null,null,null,null,null,null,null,null,null,"Cu 2x 1,5 Mm2",12.1,null,null,"42.6199552439, -5.83988102629",{"$cut":{"chars":32767,"head":"{\"coordinates\": [[[-4.893432037985476, 43.23843777304949], [-4.891455334728612, 43.23636204495404], [-4.887620939718777, 43.236227251647264], [-4.882108659743132, 43.2319959182546], [-4.873613611901437, 43.22965911024589], [-4.860156459076484, 43.2184069261102], [-4.859552600762665, 43.215553276104316], [-4.862542945019832, 43.21227200120385], [-4.860071261058288, 43.20912459009959], [-4.861688245637688, 43.2056225251229], [-4.85608362873228, 43.20347143496859], [-4.855983778293535, 43.20017737190987], [-4.852764759795995, 43.196303554143526], [-4.83920192826264, 43.18975993325437], [-4.841024133867036, 43.180780048843545], [-4.848719867955464, 43.177693394668054], [-4.851736347797437, 43.17287215688894], [-4.838852760298242, 43.16674196181176], [-4.84065572398925, 43.16237146417749], [-4.834567491864126, 43.15746266606022], [-4.838597027903186, 43.1470425959059], [-4.843854459426001, 43.14602152205794], [-4.84269836987618, 43.13332551162612], [-4.851426668874635, 43.12594482189102], [-4.845795546278427, 43.12388370215038], [-4.844321421676948, 43.120647727203405], [-4.835807670012771, 43.11629129982457], [-4.836341204612842, 43.11111404590034], [-4.832807344574485, 43.10266122577644], [-4.830249293886604, 43.10094617026722], [-4.821488960066833, 43.09933910323321], [-4.817336644091328, 43.09605537078451], [-4.816904495150887, 43.092658401022014], [-4.807479328070782, 43.091790165054086], [-4.800726992117332, 43.087781415910705], [-4.796833535572469, 43.08782462117044], [-4.788489845771331, 43.083975215837555], [-4.784437532948208, 43.083615256923586], [-4.773274769885385, 43.07908830680233], [-4.766498504609423, 43.07454662017018], [-4.767351363343536, 43.06318738683557], [-4.7661152878008, 43.05563338025191], [-4.756587683133864, 43.056113235002265], [-4.752910799624213, 43.0572231702124], [-4.749740783327116, 43.055866961147906], [-4.743985835155511, 43.05645005193201], [-4.734217032834837, 43.047071364862596], [-4.738850290643716, 43.04070666175739], [-4.743258481846408, 43.028158820971], [-4.739931163356519, 43.02290560318961], [-4.73700517260973, 43.02098697003235], [-4.738835822377771, 43.01844680864571], [-4.744284169254648, 43.01799468661962], [-4.751777822828346, 43.01567401306825], [-4.756988497040606, 43.015504095835595], [-4.758546076928602, 43.0120312889946], [-4.762400647201432, 43.00993687679215], [-4.766933973723201, 43.00156446592387], [-4.78077260691335, 42.99814423097829], [-4.782909032424294, 42.99353644193772], [-4.788023736919876, 42.99266422963856], [-4.794816490772877, 42.98665065200185], [-4.795671121883045, 42.97386823522198], [-4.800495864577865, 42.97026250408468], [-4.807251311397141, 42.967706704111926], [-4.805179171124483, 42.96184115098118], [-4.806520854408702, 42.9565700840514], [-4.802649020312689, 42.94950815595429], [-4.805145944238778, 42.94182358068457], [-4.810895813335732, 42.93601460119294], [-4.809234523846516, 42.93034069194863], [-4.813083067322102, 42.927434198796036], [-4.814533050598671, 42.92339501280585], [-4.819722964744656, 42.9223760957563], [-4.828375187218409, 42.91704234125235], [-4.83107777324222, 42.913145002647695], [-4.830453745055423, 42.9119302982155], [-4.837858185141574, 42.906732806670576], [-4.835978576292223, 42.899946168163254], [-4.83838872206351, 42.89531490282743], [-4.845998375089808, 42.8974977441143], [-4.855500754165241, 42.891706981647125], [-4.859463127662119, 42.88377227594367], [-4.858435886168349, 42.878106788671786], [-4.86064831813555, 42.87023642367939], [-4.865584151888357, 42.860547687019725], [-4.868479634949804, 42.86279677278777], [-4.880485725621612, 42.86594108919939], [-4.89694373119584, 42.863706483860994], [-4.900318660395776, 42.859994448005004], [-4.90144982708641, 42.85457265695851], [-4.899425955090646, 42.84923921213804], [-4.895737347668193, 42.84748133320501], [-4.888556025742399, 42.84113434015027], [-4.890395152911831, 42.83884368883388], [-4.892041174634421, 42.83223377764431], [-4.894762284817768, 42.829991529895416], [-4.895909080397693, 42.82708191676704], [-4.896967813231985, 42.81729383211894], [-4.90285942570100"}},"Castilla y León","07","León","León","24"]
[null,null,null,null,null,null,null,null,null,null,null,null,null,null,null,"Cu 2x 2,5 Mm2",7.41,null,null,"42.0439686698, 1.04798206104",{"$cut":{"chars":32767,"head":"{\"coordinates\": [[[[1.715645891516689, 41.892137212973594], [1.71862829287105, 41.89286967824584], [1.720294786301207, 41.89536700666208], [1.725267188674344, 41.89301805214663], [1.719108345372775, 41.88238908415243], [1.715941219853097, 41.88583953172446], [1.706600557288549, 41.8887558999469], [1.707189547586212, 41.89020712716684], [1.710061629535485, 41.88879258523468], [1.71144399931595, 41.890383371111426], [1.711683951006484, 41.891841059232256], [1.708746628909601, 41.894662833230235], [1.709076160600316, 41.896846105202776], [1.711298839650655, 41.896754702063774], [1.715645891516689, 41.892137212973594]]], [[[0.71484222697329, 42.85960692264816], [0.716212412903204, 42.85796867083549], [0.723906411447035, 42.86014030012171], [0.73480208561374, 42.853707061819634], [0.735802638160494, 42.84879419064557], [0.745867197314472, 42.84667298306352], [0.750622256794816, 42.84679615999526], [0.761240455743372, 42.842926662713076], [0.763394758626977, 42.840325623060316], [0.776260714893138, 42.836632840833296], [0.788194225284107, 42.83612088268359], [0.79651953286025, 42.84001348770269], [0.802215650364326, 42.84072453295456], [0.816400905694576, 42.837037330922975], [0.823008205951002, 42.832296590049104], [0.833193363932045, 42.82826382998145], [0.843231196409855, 42.82916932672979], [0.855797771141389, 42.8268732820511], [0.858601334091627, 42.825734258210225], [0.857811401444793, 42.82503157790322], [0.861269055601219, 42.82124124574635], [0.871105224382607, 42.81560521378543], [0.874307443486352, 42.81596493863117], [0.877687166995284, 42.81427465701567], [0.880256637965643, 42.81488076815468], [0.885483335428107, 42.8131995811452], [0.892858863237578, 42.808158563932835], [0.89818532040901, 42.80671653298483], [0.901519343924512, 42.80354146090318], [0.906653187027735, 42.80118716297743], [0.908000261102042, 42.79695429317167], [0.914966901845255, 42.796337776206805], [0.917495784236174, 42.79379309694848], [0.926789568215362, 42.789584520981265], [0.931180767784898, 42.78904645703064], [0.933746572730553, 42.78979559606196], [0.935848609834365, 42.78882283472239], [0.93335427215774, 42.79093455870896], [0.938725819366553, 42.79620602782729], [0.946527513336746, 42.80122231188453], [0.958664810143537, 42.803647925787985], [0.961126844402488, 42.805246377764135], [0.965166834136981, 42.80455709818894], [0.967971309775607, 42.800615165887486], [0.977898541675899, 42.79507493977477], [0.978672045932864, 42.79074417777419], [0.984830613450471, 42.78613580724789], [0.986296739452786, 42.78707515873321], [0.99553134691273, 42.78696896397742], [1.002802494977805, 42.790154149918735], [1.006511568717776, 42.790420409917346], [1.010019626446617, 42.78852370393779], [1.01412993899647, 42.78875765169308], [1.016997705438485, 42.78717132402479], [1.019554970100834, 42.78758565404412], [1.031546655390061, 42.785137643074606], [1.032844815298877, 42.787054723037365], [1.038254966708853, 42.785099040955494], [1.039360905113153, 42.78668968913547], [1.041403295878744, 42.78632942023634], [1.044228736399517, 42.78429369684317], [1.042886137731959, 42.78132487996274], [1.044425293173672, 42.78074824883317], [1.053098767991378, 42.782359014866614], [1.058766138508247, 42.781734850820335], [1.059352556030827, 42.78303761511823], [1.073583651492291, 42.782342542697286], [1.076338090969535, 42.78724149402363], [1.07853233744243, 42.78789256389432], [1.083226130024006, 42.78454677524832], [1.083118033949207, 42.78253374921199], [1.090321123851906, 42.776658025718476], [1.098907959753866, 42.773064243088875], [1.108983834087775, 42.77111806786462], [1.109335255027009, 42.76535202715765], [1.119407912493978, 42.76282881425314], [1.121552109330757, 42.75942018511127], [1.128967092046173, 42.75443477003242], [1.132108037064514, 42.75004456107316], [1.130537065990451, 42.73909869917174], [1.135029723983338, 42.73557798664193], [1.13302886143504, 42.73157156961543], [1.133576521144725, 42.72823838299801], [1.139355638489863, 42.72442790965768], [1.149572069521403, 42.72124859092347], [1.15368237308834, 42.71660654719233], [1.165687339071164"}},"Cataluña","09","Lleida","Lleida","25"]
[null,null,null,null,null,null,null,null,null,null,null,null,null,null,null,"Cu 2x 4 Mm2",4.6100000000000003,null,null,"43.011764, -7.44638404764",{"$cut":{"chars":32767,"head":"{\"coordinates\": [[[[-7.076086210906103, 43.555416375734794], [-7.076187751075915, 43.555086390841126], [-7.076896180475432, 43.555494364857346], [-7.076086210906103, 43.555416375734794]]], [[[-7.041883122360779, 43.55617171094577], [-7.044317481322502, 43.55703077087473], [-7.043673455739049, 43.557396825884496], [-7.041883122360779, 43.55617171094577]]], [[[-7.062176971031356, 43.559539016753014], [-7.062714047688662, 43.55924132588789], [-7.062899075484385, 43.55941482679776], [-7.062176971031356, 43.559539016753014]]], [[[-7.116988608752871, 43.5625092081773], [-7.118356146449462, 43.56204626967888], [-7.118211864438382, 43.562653561732176], [-7.116988608752871, 43.5625092081773]]], [[[-7.344365310919825, 43.66392435290149], [-7.345188743540309, 43.66374720281681], [-7.345339046958734, 43.664145542832784], [-7.344365310919825, 43.66392435290149]]], [[[-7.60948620480417, 43.675737804763784], [-7.609979387980082, 43.67489074820226], [-7.60967794121844, 43.67581166174201], [-7.60948620480417, 43.675737804763784]]], [[[-7.491047596173743, 43.731971067006306], [-7.488291855037377, 43.73095323414735], [-7.490558670114051, 43.72919145326649], [-7.493847177791007, 43.73025227969475], [-7.491932927208967, 43.73132548085021], [-7.492558546312275, 43.73212607267521], [-7.491047596173743, 43.731971067006306]]], [[[-7.634826605486777, 43.75298523271843], [-7.635973133369041, 43.751180171634346], [-7.63209820906758, 43.75062061277208], [-7.63220026756545, 43.74668713915475], [-7.630029857888429, 43.74655309975311], [-7.630186180019339, 43.743511657799274], [-7.631304848449704, 43.74129212069623], [-7.634891595902938, 43.740299624833106], [-7.635691216880291, 43.73899460219289], [-7.630099863598792, 43.73477691720155], [-7.631302055587745, 43.72888478563452], [-7.628731979152607, 43.726161805007315], [-7.62622635144916, 43.7255194488539], [-7.628929179120521, 43.72241857710244], [-7.628623864213305, 43.72110932916721], [-7.623643327595843, 43.71796110083243], [-7.619989281954788, 43.71869133421631], [-7.619865593821633, 43.71705116683792], [-7.616568169467058, 43.71738943111344], [-7.615157466822571, 43.718812936658374], [-7.613922560886127, 43.71476421923165], [-7.608276543322829, 43.7184321420435], [-7.606369009444125, 43.71771562307836], [-7.608495839151749, 43.71593175392418], [-7.60844242442666, 43.71502171509368], [-7.607163878333578, 43.715555391191], [-7.606866484770608, 43.7123193591342], [-7.611434869844064, 43.71122248376603], [-7.610309716475689, 43.709957275849305], [-7.613740940400516, 43.70326409275514], [-7.610133078944939, 43.6998043156545], [-7.60701285446661, 43.7027818271981], [-7.604844710340736, 43.70225003304729], [-7.604561796721842, 43.697057723715155], [-7.606412129476636, 43.69298179968448], [-7.608253558130218, 43.69232566908201], [-7.608040735561312, 43.69097318894054], [-7.613605306471007, 43.68808814815146], [-7.614488274038899, 43.67957883699899], [-7.61381927978207, 43.677821272009496], [-7.61135546775678, 43.677118366086475], [-7.612038929381351, 43.67449524668711], [-7.60880400890592, 43.67255339986814], [-7.60298790073357, 43.671056587985284], [-7.598468321129518, 43.67170403784666], [-7.596315461838173, 43.672818341206835], [-7.59909994457212, 43.67637548903582], [-7.595848982880726, 43.67331708282642], [-7.596654714198719, 43.667557618941224], [-7.599488109301666, 43.66585039516159], [-7.597880923545062, 43.66258072426071], [-7.602270199822122, 43.66325849919335], [-7.60224220652133, 43.65829218987051], [-7.599789441079111, 43.65790058111186], [-7.597575960777469, 43.65924773293594], [-7.596586952480242, 43.665710564951254], [-7.594456928363452, 43.66625697520836], [-7.593810408158307, 43.66817365377788], [-7.595075497488343, 43.67339431688686], [-7.598931459252316, 43.6775599039936], [-7.596759581728168, 43.67695938877504], [-7.594197897354337, 43.67857431301681], [-7.596109481736661, 43.679894124716995], [-7.595922613292823, 43.68263478219999], [-7.593511078725496, 43.68450257677475], [-7.590071871472921, 43.68423794492407], [-7.590908310800425, 43.685508670997805], [-7.589168881355791, 43.687"}},"Galicia","12","Lugo","Lugo","27"]
[null,null,null,null,null,null,null,null,null,null,null,null,null,null,null,"Cu 2x 6 Mm2",3.08,null,null,"40.4950873744, -3.71704619215",{"$cut":{"chars":32767,"head":"{\"coordinates\": [[[[-4.254107365433731, 40.65866522884571], [-4.256046449043171, 40.651401080890416], [-4.26736778810982, 40.65316114978854], [-4.281543584178896, 40.65315661084978], [-4.301924735618164, 40.651245352841606], [-4.319709734326746, 40.64751211162308], [-4.323410496853288, 40.6522442097381], [-4.324772579979292, 40.657723738637245], [-4.318605223345598, 40.66170395321972], [-4.317406808772823, 40.666933527088524], [-4.294297721750698, 40.67652754316354], [-4.288124515287876, 40.683171830118766], [-4.284401278709585, 40.682216482992516], [-4.275011154010386, 40.67652338869604], [-4.267408141330646, 40.67454274718026], [-4.259852244389297, 40.66574814216315], [-4.254461036652707, 40.6620688879464], [-4.254107365433731, 40.65866522884571]]], [[[-3.536706437430017, 41.16057610319649], [-3.537626762336859, 41.155332771090805], [-3.541099713903956, 41.149666732615046], [-3.533456881602692, 41.14714215769888], [-3.530099696824553, 41.141626642252405], [-3.526183360189376, 41.139149335720944], [-3.516527941427252, 41.13880281890105], [-3.515574333040766, 41.137536047162136], [-3.509263548693862, 41.13639476420346], [-3.505611494618707, 41.13031951799554], [-3.501724124159859, 41.12673411582714], [-3.499757993175591, 41.12007399161288], [-3.495368739357496, 41.11598967709229], [-3.4940949938616, 41.11354582573705], [-3.495428400967084, 41.11187632416423], [-3.493007495175227, 41.11130654964375], [-3.494011517913845, 41.10987536565423], [-3.492848126857383, 41.10703111716934], [-3.489630823243678, 41.105514264723745], [-3.489467328963679, 41.10162076076277], [-3.490822160888658, 41.099651260603586], [-3.490485455252145, 41.09727996621019], [-3.488212493902824, 41.096507709838434], [-3.488679183964313, 41.09424198599078], [-3.483425604417426, 41.09294434215983], [-3.474612445167323, 41.09518949921754], [-3.474489413702654, 41.09328493090558], [-3.456545084405395, 41.08705687190262], [-3.455535360059743, 41.084107065762886], [-3.448945441306255, 41.081803362260025], [-3.448389938405947, 41.080636244982756], [-3.445398800038118, 41.08107568717676], [-3.444236449230765, 41.08243494623901], [-3.439701000888307, 41.08106954016745], [-3.435501306866457, 41.084022042098844], [-3.430320884319664, 41.083605398824915], [-3.429490561621079, 41.08444625268511], [-3.425864630554402, 41.08342370179509], [-3.427737173255693, 41.080811692989805], [-3.426728778416659, 41.07637439581619], [-3.425306941154615, 41.076114797983664], [-3.426359135151952, 41.07185009166874], [-3.42514615260023, 41.07165635621687], [-3.427056067014028, 41.06898921973785], [-3.426006251755566, 41.065661893659225], [-3.43108872829195, 41.06240375460608], [-3.43127642408404, 41.058339476672444], [-3.435614777561555, 41.053711062151926], [-3.434730087923675, 41.049459865067746], [-3.438278541992052, 41.046780072616436], [-3.43893548624757, 41.042668968169494], [-3.431178558023693, 41.04166941019629], [-3.422033871924793, 41.02599287805708], [-3.412912533040012, 41.01871110166965], [-3.407997760289093, 41.01634136908531], [-3.397519854832564, 41.00683812084356], [-3.394450860377364, 41.00027715164482], [-3.400511357018068, 40.99573872000606], [-3.418296618034729, 40.98756297770926], [-3.416301810131704, 40.98434792722832], [-3.418485803233623, 40.97949004192717], [-3.416848461033207, 40.97695284825219], [-3.421553718812127, 40.96732404669882], [-3.428005464996754, 40.95988294283802], [-3.432017128154925, 40.94945985692467], [-3.436039701352168, 40.94612794971023], [-3.436745107920629, 40.939759073177946], [-3.435417971954182, 40.93756244698976], [-3.437032972155125, 40.93349723964994], [-3.448855116602799, 40.92252665088057], [-3.448382877647847, 40.91871705263135], [-3.451287164199067, 40.91286476485193], [-3.445572667164705, 40.91032764014741], [-3.444062754580693, 40.90684900375701], [-3.450527352063724, 40.90535115597813], [-3.458388566607254, 40.90843264794934], [-3.460577726818671, 40.9066583180562], [-3.457862512278536, 40.901012746622534], [-3.458560152911379, 40.900076716648755], [-3.460831222408693, 40.90023074216997], [-3.460599369928822, 40.89846962915"}},"Comunidad de Madrid","13","Madrid","Madrid","28"]
[null,null,null,null,null,null,null,null,null,null,null,null,null,null,null,"Cu 2x 10 Mm2",1.83,null,null,"36.8138591651, -4.72586195603",{"$cut":{"chars":32767,"head":"{\"coordinates\": [[[-4.406576081191073, 37.27412094416451], [-4.402978668041324, 37.276579157658766], [-4.397500206042863, 37.274922423598326], [-4.394265221787792, 37.276258426713625], [-4.392276553869642, 37.27422681568207], [-4.389821304586277, 37.27380499285386], [-4.383413350373398, 37.277413190820916], [-4.379696469375748, 37.2752302755837], [-4.377723936996762, 37.27035008058117], [-4.380810742349134, 37.26336489398548], [-4.380257596628102, 37.26024377889227], [-4.37606406235413, 37.25721904775104], [-4.379925695181711, 37.24822395474259], [-4.379711917703679, 37.24577484774952], [-4.3771953610971, 37.24502899171588], [-4.377440556253845, 37.24177234411795], [-4.385008741250034, 37.23825910765145], [-4.382575183585783, 37.23154555189967], [-4.371638107865, 37.21520534925418], [-4.364468561055991, 37.21385500619877], [-4.352651333986183, 37.21475661186182], [-4.345076679323365, 37.214049667994544], [-4.328852842085768, 37.20531849302473], [-4.322630012686711, 37.20452277624714], [-4.32317240377713, 37.20331792225221], [-4.32614561536515, 37.202581659787164], [-4.329476623235885, 37.198479308944115], [-4.332260422351334, 37.1914626659637], [-4.327413845205211, 37.186199126006066], [-4.327617761876364, 37.184331087775426], [-4.323364180615533, 37.18072819026184], [-4.313342445050228, 37.16012672182229], [-4.308625206440388, 37.15171520495208], [-4.302872035136392, 37.1452077049235], [-4.297517562206695, 37.13429692864842], [-4.291538340641288, 37.130252024014325], [-4.287067624898217, 37.11952041604364], [-4.287260864193991, 37.1116494567291], [-4.285632460230702, 37.10853038270892], [-4.286583669217017, 37.09822650873436], [-4.283460788421191, 37.091869702179594], [-4.284648233666068, 37.08889137196107], [-4.281001706026485, 37.0567159739871], [-4.272755140277247, 37.0417247366601], [-4.27164965911555, 37.03004575303449], [-4.27003678343025, 37.02703438884227], [-4.272510175987489, 37.01490240564578], [-4.260443805665133, 37.017302640020674], [-4.256276099752232, 37.02019514101227], [-4.25505645709102, 37.02258767459331], [-4.251926502062291, 37.02298132613481], [-4.231335540105257, 37.01694106821999], [-4.223348244316709, 37.01233643574706], [-4.224399286673837, 37.00918882619046], [-4.220673831256797, 37.005351262095324], [-4.215422554092027, 36.991767179953854], [-4.207153699343884, 36.98618175891642], [-4.193268465150069, 36.98060729899258], [-4.191766235856665, 36.97865737275929], [-4.188026808043696, 36.977333691717], [-4.177132940389802, 36.96665252556143], [-4.169239196053235, 36.96246694611072], [-4.16664079034776, 36.9570750681937], [-4.147444222120877, 36.95401702964097], [-4.141998935804149, 36.951897174249495], [-4.111327166865339, 36.94965515213301], [-4.099892905075878, 36.952709170575545], [-4.099159474663848, 36.94231375711246], [-4.0920001156484, 36.933248514621596], [-4.087064368133919, 36.93042726482362], [-4.081624098908065, 36.93001720706549], [-4.074154012635918, 36.92657851591518], [-4.072245707104812, 36.92420698116598], [-4.063650648924252, 36.921345662671456], [-4.053772959113005, 36.914970490688766], [-4.047975962599632, 36.90398844009737], [-4.04569323117323, 36.90286372308964], [-4.035629213704099, 36.90483578486236], [-4.014154285252996, 36.89873806862329], [-4.012199605093655, 36.896059479783105], [-3.99921144201731, 36.889832371697686], [-3.98272717599233, 36.89258391097628], [-3.972688411064135, 36.89126926305687], [-3.970779207217756, 36.89205107398246], [-3.961532028734801, 36.88940394068153], [-3.960004724766812, 36.8875322895647], [-3.952119669833978, 36.88786616079729], [-3.94645014605608, 36.88495472314877], [-3.94413455784984, 36.88646053398786], [-3.940034506755941, 36.88431157517248], [-3.929524786565339, 36.88287979812787], [-3.924102665104836, 36.878982788143766], [-3.921614218580082, 36.870799124713265], [-3.918597162019683, 36.86808211291952], [-3.912554338833852, 36.86939968399134], [-3.909569530893827, 36.86747542210005], [-3.904821486357925, 36.868232783946965], [-3.899101427853708, 36.86743784760505], [-3.895498206197308, 36.86536472923641], [-3.890564729623847, 36."}},"Andalucía","01","Málaga","Málaga","29"]
[null,null,null,null,null,null,null,null,null,null,null,null,null,null,null,"Cu 2x 16 Mm2",1.1499999999999999,null,null,"35.2908279949, -2.95053552337","{\"coordinates\": [[[-2.952535036387899, 35.32000300257934], [-2.949154241189142, 35.31597601716674], [-2.944665919364812, 35.31508552369891], [-2.947173614989441, 35.30867503425136], [-2.941965528823506, 35.30303385014371], [-2.938903376835874, 35.302547046550146], [-2.935178755055385, 35.29668079385854], [-2.935598675229868, 35.29474024022772], [-2.934377678807493, 35.294485748048274], [-2.933632655636698, 35.296050473068604], [-2.932163211257917, 35.293716843918865], [-2.924982837054729, 35.29329500679813], [-2.923214572588241, 35.29012547462083], [-2.924330963789012, 35.29013496859005], [-2.925176724934088, 35.29257782123664], [-2.92828418255482, 35.292762331927484], [-2.928720350557859, 35.291129979961084], [-2.929411243046241, 35.29285102516337], [-2.93169585823974, 35.292987047176574], [-2.931471945070359, 35.291639283044354], [-2.934449641946609, 35.29132829769297], [-2.934582486607425, 35.2928559061664], [-2.935841618310297, 35.29208250804292], [-2.93491523067351, 35.29132197580586], [-2.93586398815744, 35.290044610125214], [-2.932743671153455, 35.289670446902505], [-2.935931377973477, 35.28972584115058], [-2.936958850334168, 35.28839853696831], [-2.937399437150121, 35.28364179416076], [-2.936022237174531, 35.283168148147084], [-2.937067954318688, 35.28184159076484], [-2.935322466636207, 35.278489133197986], [-2.931719171317998, 35.27514573115908], [-2.927719752197186, 35.27456965724788], [-2.924791454576739, 35.278592330725424], [-2.927925073833476, 35.272986802661826], [-2.934530841563442, 35.26890557681929], [-2.95035021503933, 35.265625577057364], [-2.954669289772526, 35.2731722446702], [-2.968158769371247, 35.28204322601885], [-2.968034074226665, 35.285149388254986], [-2.964703053779479, 35.28708237353162], [-2.965104057230728, 35.28852958914371], [-2.97004550096247, 35.28893764988554], [-2.96768713318586, 35.300914394125414], [-2.961019459854718, 35.314141365525835], [-2.952535036387899, 35.32000300257934]]], \"type\": \"Polygon\"}","Melilla","19","Melilla","Melilla","52"]
[null,null,null,null,null,null,null,null,null,null,null,null,null,null,null,"Cu 2x 25 Mm2",0.72699999999999998,null,null,"38.0023681653, -1.48575629332",{"$cut":{"chars":32767,"head":"{\"coordinates\": [[[[-1.54668694559277, 37.40733082022349], [-1.548446351772257, 37.40808253789229], [-1.547483177226299, 37.40939563617861], [-1.543921061579035, 37.408964191189575], [-1.54668694559277, 37.40733082022349]]], [[[-1.266176427825368, 37.55480740885017], [-1.270249338119635, 37.5549121978405], [-1.269463361653336, 37.55756841063043], [-1.26640654206522, 37.5580642761903], [-1.266176427825368, 37.55480740885017]]], [[[-1.149850521124435, 38.74606705871347], [-1.119670597769889, 38.7377188230762], [-1.116773124041788, 38.73240091696871], [-1.115599912602626, 38.71138712605136], [-1.081595712861593, 38.686775209267545], [-1.072823111648204, 38.68252194310626], [-1.042984762799004, 38.66125648710664], [-1.034103157314159, 38.65656605864332], [-1.026922093204833, 38.65550348591686], [-1.023963925702883, 38.63998669200662], [-1.015919930948463, 38.63505683273415], [-1.01204417390966, 38.60612076823754], [-1.001568914889956, 38.57267455426164], [-1.009470903065882, 38.55794145294967], [-1.015885514693315, 38.53709137401767], [-1.026061768572404, 38.52281919124437], [-1.017578238929294, 38.50217618097988], [-1.013645631109363, 38.49673003089106], [-1.034865187389885, 38.47452480177614], [-1.059302853072881, 38.45574813409725], [-1.082093773889412, 38.441129414664466], [-1.094162264235765, 38.43792935902715], [-1.077205901189632, 38.43147047515345], [-1.085366317604788, 38.429153224239165], [-1.087764198677541, 38.40687198809802], [-1.088109004422969, 38.402047642051514], [-1.086696190737948, 38.39787048024492], [-1.088062045889812, 38.36776854478582], [-1.084384258674981, 38.34621684312783], [-1.058576030668061, 38.34555774499635], [-1.028420825356898, 38.33856625286735], [-1.010923187826143, 38.331611420775694], [-0.98915220340342, 38.32087716616253], [-0.984489259867647, 38.30712719225924], [-0.971492364268407, 38.29008819411945], [-0.967676574266338, 38.275640263599456], [-0.968596539847112, 38.25575978301419], [-0.977811691593617, 38.238302292900784], [-0.988545853163032, 38.199531519099864], [-0.991687895023892, 38.1961430297481], [-0.99388963075095, 38.19039548708081], [-0.999459730789927, 38.18352015592575], [-1.004892617660792, 38.17210991976632], [-1.009073447061688, 38.166566833829165], [-1.02592327799999, 38.14743211469307], [-1.036761678278324, 38.13771967306975], [-1.030313887375914, 38.11528135280733], [-1.030335394840421, 38.09707868086309], [-1.026587112333685, 38.0901759846799], [-1.022599225784442, 38.075690542250676], [-1.017513373379192, 38.06772876401592], [-1.007134162229634, 38.055369577027975], [-1.001900111158742, 38.053802757675214], [-1.000713159088984, 38.05177302159388], [-0.998625821118436, 38.05142206162892], [-0.981863072863717, 38.030643242167045], [-0.981946222723086, 38.0292749310103], [-0.966022311399221, 38.01268962012715], [-0.95771125739236, 37.99696467576609], [-0.93418694119805, 37.9688880382186], [-0.92118853822571, 37.94423748788292], [-0.900180248632045, 37.92312866212987], [-0.857221333118312, 37.88521745062689], [-0.853468863564057, 37.88366214779618], [-0.83916144544111, 37.87018930525986], [-0.83072525431851, 37.86441985870678], [-0.803907937973119, 37.85914627590517], [-0.797521115728953, 37.8530072219105], [-0.790443040772029, 37.84835975282409], [-0.781707972069548, 37.84480708418169], [-0.77131463042056, 37.84389873271487], [-0.762208956357724, 37.84701512915539], [-0.761596855102861, 37.83794691697248], [-0.757443604879549, 37.823134120897706], [-0.751611240795034, 37.82290566508698], [-0.750688273044582, 37.82150026907902], [-0.756641128158115, 37.82262318388793], [-0.758038894163816, 37.8188559989588], [-0.756792839236545, 37.81836365094605], [-0.758138265800545, 37.81820002669761], [-0.758159133664615, 37.816758606690975], [-0.75280010807299, 37.80168830194522], [-0.751750541647855, 37.79472941160991], [-0.748194159048703, 37.790678357599674], [-0.761986929650389, 37.79458211288759], [-0.761368312016522, 37.79889583476399], [-0.77530798142167, 37.818787234642606], [-0.776945875187625, 37.81985453757688], [-0.784684946700292, 37.81900018014041], [-0.785686412833"}},"Región de Murcia","14","Murcia","Murcia","30"]
[null,null,null,null,null,null,null,null,null,null,null,null,null,null,null,"Cu 2x 35 Mm2",0.52400000000000002,null,null,"42.6672011509, -1.64611414443",{"$cut":{"chars":32767,"head":"{\"coordinates\": [[[[-1.147643003840329, 42.44100489171217], [-1.144974809817123, 42.44187014596468], [-1.144706650128394, 42.437363078756384], [-1.148985507286351, 42.43284842068045], [-1.151171751566353, 42.43167700485403], [-1.151679129920254, 42.42847921891776], [-1.152964929010647, 42.428157765724706], [-1.152427426551951, 42.42328608514582], [-1.154339436735309, 42.41446443971849], [-1.158770155888618, 42.409663695741315], [-1.17158131402313, 42.40665394515422], [-1.17438617234375, 42.403798891761355], [-1.183383027187995, 42.401105190244294], [-1.187799090327508, 42.40303030367229], [-1.187793713012204, 42.40532665585519], [-1.185048988814998, 42.408218973706994], [-1.18042941504284, 42.417520510090654], [-1.182742672120876, 42.421168503976695], [-1.182826030389341, 42.424592007778976], [-1.166610778350915, 42.43251056684363], [-1.162956440758286, 42.43234392998905], [-1.156462220430367, 42.437813988613186], [-1.154032195840144, 42.44148519010198], [-1.149413247295381, 42.44185188177351], [-1.147643003840329, 42.44100489171217]]], [[[-1.096228373219731, 42.48566527003293], [-1.091663625426001, 42.48573335690197], [-1.085141398322443, 42.48336410902783], [-1.088338656030541, 42.47586195572492], [-1.087473976365635, 42.4746948160559], [-1.075340253058224, 42.46812464975816], [-1.069554627419768, 42.46648006114019], [-1.069776540040992, 42.46159545996508], [-1.06762269889159, 42.45997696519344], [-1.065787652768528, 42.45378793620971], [-1.062469923794353, 42.452829604938074], [-1.056515334932311, 42.44833680661774], [-1.054360707757092, 42.448804511665806], [-1.050962806838678, 42.44192059172434], [-1.052862053758423, 42.43791844409195], [-1.057165904742547, 42.433984138916145], [-1.061638919274431, 42.4344021338341], [-1.064530998619293, 42.43602698986342], [-1.067276150414543, 42.43452441115471], [-1.073940164009229, 42.437239292083746], [-1.080530292070176, 42.438412614039414], [-1.083414434799436, 42.43712806121455], [-1.093376341668605, 42.44017612306481], [-1.109019692959487, 42.441534185025695], [-1.116293712937714, 42.44507618971286], [-1.125106147247424, 42.44517578074595], [-1.129364531800023, 42.446722326216474], [-1.12572534878621, 42.45563035026109], [-1.117232876414441, 42.46282348705138], [-1.109522096443348, 42.474925892801785], [-1.102082243870368, 42.48279963195822], [-1.102851019395616, 42.48433430422364], [-1.096228373219731, 42.48566527003293]]], [[[-1.664269842412802, 43.313744484090726], [-1.654776849833779, 43.31255622896026], [-1.65243861599763, 43.309971558621854], [-1.645078874283359, 43.30676815899293], [-1.635376394580063, 43.30904920097733], [-1.632852292125113, 43.30723515478979], [-1.624121818305342, 43.30600000309568], [-1.622694519286389, 43.30071200212287], [-1.628530130780571, 43.29254656996029], [-1.6305533416163, 43.284475418672], [-1.62820191332519, 43.28082139409822], [-1.625572709778626, 43.27069606807418], [-1.623604653704662, 43.27043383984035], [-1.621698274161545, 43.26357941588558], [-1.617579042239676, 43.2577934569493], [-1.610387994254355, 43.25470513313865], [-1.608718972965506, 43.25181699316943], [-1.599954327232324, 43.25445421685342], [-1.581550386597959, 43.25375550815117], [-1.575234692958092, 43.25003990866462], [-1.56967133208045, 43.25569782016948], [-1.563276664848982, 43.2697781766642], [-1.560429994443415, 43.27298733492652], [-1.560707269337382, 43.27494702278426], [-1.557127116417508, 43.27955039171694], [-1.560078435163691, 43.28417469420522], [-1.563682435659421, 43.28458687416466], [-1.565098786011713, 43.288042577783386], [-1.551730967946796, 43.29196945085739], [-1.539766234812419, 43.2916035939345], [-1.535304675597007, 43.29468346372091], [-1.532461805963441, 43.29355358993824], [-1.524838069150122, 43.293170273175], [-1.51486403592302, 43.29445772314541], [-1.506106638695846, 43.29349052781644], [-1.502343325577792, 43.288293086880444], [-1.49883831134152, 43.28718689986886], [-1.496533192101688, 43.283186830743134], [-1.492744265319912, 43.2816461988528], [-1.492354789050409, 43.280386647893614], [-1.483035244084713, 43.28341715285771], [-1.4780"}},"Comunidad Foral de Navarra","15","Navarra","Navarra","31"]
[null,null,null,null,null,null,null,null,null,null,null,null,null,null,null,"Cu 2x 50 Mm2",0.38700000000000001,null,null,"42.1964503002, -7.59259790937",{"$cut":{"chars":32767,"head":"{\"coordinates\": [[[-7.920549280708581, 42.566646964066024], [-7.917795228404487, 42.56167879822598], [-7.91192180412289, 42.55606144803542], [-7.901197241946382, 42.55393798298527], [-7.890406919497909, 42.55018676615422], [-7.888883766644543, 42.54145595825397], [-7.889097364459699, 42.53811568411929], [-7.894497133143078, 42.53928905413554], [-7.901380707572428, 42.53624812888138], [-7.902452604319406, 42.53501377380831], [-7.900601769406307, 42.5315909427263], [-7.903123067322024, 42.52897095574165], [-7.907841386607042, 42.53092918621607], [-7.912353415871986, 42.52731415691643], [-7.924370065346539, 42.52503243872999], [-7.901965844996436, 42.52134997288626], [-7.903049569860896, 42.5145241826773], [-7.911089748575253, 42.512459442957976], [-7.913543563250282, 42.50837460965196], [-7.905616041357578, 42.506590403209074], [-7.900436808178136, 42.50695658381745], [-7.89718212207099, 42.50563760610934], [-7.894537621112275, 42.508541795169975], [-7.890062623996742, 42.510759018008706], [-7.878726971169856, 42.51161254122879], [-7.875778167705307, 42.51093709285144], [-7.879920739656621, 42.50632175465531], [-7.878256592625983, 42.50261151679801], [-7.875341809259521, 42.50189856981237], [-7.866481080618429, 42.504049752185736], [-7.861861540980435, 42.504102230673034], [-7.848216204573213, 42.49821753172637], [-7.84548909543945, 42.49835114202201], [-7.843212204858236, 42.496755019821386], [-7.842448848869032, 42.49050313199116], [-7.828656947831434, 42.49338229863924], [-7.824330928221285, 42.49060289586837], [-7.819156175838706, 42.491649420664956], [-7.811037310994169, 42.48778686601352], [-7.807204360474064, 42.481114646977154], [-7.801671033867653, 42.48001468073835], [-7.797685762312808, 42.48070417121932], [-7.793102015149147, 42.48358839512813], [-7.785190007161709, 42.486062554899284], [-7.781462757807595, 42.490936216209505], [-7.773798029068518, 42.49459674026651], [-7.771319544859481, 42.493682817968434], [-7.765390768186807, 42.493948097694485], [-7.761721002926402, 42.48856396386818], [-7.7580463723903, 42.486790207921494], [-7.755658975554411, 42.48770881566775], [-7.753075945412578, 42.48685289992514], [-7.753119323261102, 42.484699312759766], [-7.748674374792277, 42.47997717618051], [-7.751284663413148, 42.47911248215621], [-7.753296886955382, 42.47597670426454], [-7.760185852174249, 42.476365401623816], [-7.761504013971439, 42.47850731093711], [-7.76445273748579, 42.47889765619308], [-7.773960354640917, 42.47693450702362], [-7.782032405581125, 42.47210455681164], [-7.788716251284644, 42.473472431213644], [-7.791284236442229, 42.47095197363687], [-7.788617901930794, 42.46804759602226], [-7.789262968661861, 42.46598585813356], [-7.784037651010249, 42.46858144310677], [-7.781644242648519, 42.46813235101918], [-7.776018541383387, 42.46037255818316], [-7.766167970808976, 42.45683112283126], [-7.764500072413585, 42.45824212077264], [-7.760627287898909, 42.45351461015414], [-7.753094869323323, 42.451018940724026], [-7.739537458219845, 42.45662348696345], [-7.735750390051183, 42.45525885785663], [-7.732284398629753, 42.455337431182464], [-7.7307050435788, 42.45392460077996], [-7.713538999366856, 42.45236811994533], [-7.705311433881772, 42.44398266196217], [-7.701843002636378, 42.43257395568485], [-7.698236758148067, 42.42953495798486], [-7.6822801086173, 42.42253644398448], [-7.672009266627346, 42.42168700981575], [-7.662508353599539, 42.42302008414899], [-7.657295163204808, 42.415156414208155], [-7.647799918546641, 42.41393107576568], [-7.639512403991142, 42.408982505128236], [-7.631776184627377, 42.407045172125706], [-7.629022892298296, 42.40215970998575], [-7.629148582776366, 42.39644641524918], [-7.624102603890295, 42.3920857517654], [-7.619431413819074, 42.384882634094524], [-7.615416860779497, 42.384459483203216], [-7.60252216021823, 42.389309733901364], [-7.595528223265408, 42.396811814062055], [-7.576484577938916, 42.404859243194615], [-7.572278712489927, 42.40432518399007], [-7.566027464885305, 42.40105450466939], [-7.554781233956731, 42.39036548886279], [-7.549874612517496, 42.38701337610422], [-7.5"}},"Galicia","12","Ourense","Orense","32"]
[null,null,null,null,null,null,null,null,null,null,null,null,null,null,null,"Cu 3x 15 Mm2",12.1,null,null,"42.3718338546, -4.53585717538",{"$cut":{"chars":32767,"head":"{\"coordinates\": [[[[-4.071987588784325, 42.16534113422007], [-4.068984295312347, 42.163126624875304], [-4.065637354921765, 42.16349995390516], [-4.067101604343261, 42.16202732398905], [-4.067562628730226, 42.157051614053366], [-4.069952474372792, 42.15593061718531], [-4.074482688232075, 42.156122492193504], [-4.072775558612165, 42.15179744405485], [-4.064530450828639, 42.14297601974149], [-4.063869035657995, 42.13889332986848], [-4.05979455241368, 42.13620210289428], [-4.062137258961665, 42.13157823511019], [-4.067752732905632, 42.13309326175398], [-4.070041142582887, 42.136773497057575], [-4.073043784776268, 42.13687160364639], [-4.083476914605754, 42.14126773274927], [-4.090060469693692, 42.14198891625383], [-4.095922037109675, 42.14014094363961], [-4.099459202049968, 42.137549314076786], [-4.102733096831552, 42.137238735943825], [-4.110036939080598, 42.143184531258505], [-4.11184336667537, 42.158576741110934], [-4.109300369056656, 42.159213742828534], [-4.10777864901653, 42.15802155504616], [-4.101133865657087, 42.15876099274727], [-4.094228230403817, 42.157719200243086], [-4.089604713925878, 42.16056417072311], [-4.083544603560743, 42.16296311169972], [-4.076291679618566, 42.16785861490486], [-4.071987588784325, 42.16534113422007]]], [[[-4.168588143847671, 42.8115353466263], [-4.174558558329996, 42.81161841390929], [-4.182344714139985, 42.82034568312795], [-4.179249526607743, 42.82290810494936], [-4.174616293951651, 42.82308180897314], [-4.163076917595829, 42.82094816221971], [-4.160733752907062, 42.81797305288072], [-4.159885984027341, 42.81515393901724], [-4.161095543099537, 42.81311544382353], [-4.168588143847671, 42.8115353466263]]], [[[-4.098008335729525, 42.82367023606973], [-4.094870941751976, 42.82405139364206], [-4.088522085905004, 42.818492464206784], [-4.089043001870309, 42.809833253657985], [-4.087709018046397, 42.80559531076169], [-4.089064451842644, 42.79989103110848], [-4.101041838646131, 42.79396805412431], [-4.108920154417708, 42.80307771582626], [-4.105316075768569, 42.80878601500152], [-4.113077471314329, 42.81668975901947], [-4.111742134627669, 42.818629877984165], [-4.112444280311619, 42.82231531801804], [-4.110599986032748, 42.82384612604845], [-4.107036355825898, 42.827761893723746], [-4.098008335729525, 42.82367023606973]]], [[[-4.000868857971004, 42.809799119256255], [-3.997057502951559, 42.80323127126792], [-3.997556131714609, 42.78781857889142], [-3.995941021919224, 42.78622059965702], [-3.999649559364526, 42.768978790661336], [-4.002525963107658, 42.76846738882789], [-4.003091270220971, 42.76335630194564], [-4.009374515814519, 42.765687641228304], [-4.018524890045829, 42.76394069515722], [-4.030433404813148, 42.766409939224715], [-4.034579384072591, 42.76582329606216], [-4.040862002642029, 42.76730636115245], [-4.045910509385955, 42.7666120340913], [-4.049696301945718, 42.77293537096757], [-4.048812168364972, 42.7734207771664], [-4.05021569257164, 42.779801871724494], [-4.043752802785887, 42.78879431072768], [-4.037831838763283, 42.79080225101544], [-4.03356807509873, 42.786608168633386], [-4.029867788679381, 42.788343510810584], [-4.028347816760713, 42.790329321081714], [-4.031789006594307, 42.79359444868928], [-4.032919030627879, 42.80125691700776], [-4.022262940741509, 42.8069447909581], [-4.017905418114119, 42.80747883599608], [-4.014181548223525, 42.806377156646164], [-4.020778967909603, 42.81934951574172], [-4.0110376720029, 42.83037738787853], [-4.003554134357674, 42.83140669964384], [-4.001605180958269, 42.82966763603861], [-3.999631506820578, 42.81955380001253], [-4.000868857971004, 42.809799119256255]]], [[[-4.456763227756186, 43.057045139662755], [-4.449416148694165, 43.05740854176663], [-4.447551592015739, 43.05853973403579], [-4.442479560191156, 43.05590232603867], [-4.431865910312023, 43.045688949098725], [-4.422430302113369, 43.04275391968452], [-4.414984259249779, 43.041414448956445], [-4.413953814363731, 43.04198542682209], [-4.398114914208608, 43.03486802786564], [-4.392273439410549, 43.02733003289539], [-4.389169105232091, 43.025737871019906], [-4.386189527283636, 43.016"}},"Castilla y León","07","Palencia","Palencia","34"]
[null,null,null,null,null,null,null,null,null,null,null,null,null,null,null,"Cu 3x 2,5 Mm2",7.41,null,null,"42.435764706, -8.46106294738","{\"coordinates\": [[[[-8.936459570853652, 42.349388790667874], [-8.93395846975829, 42.34886157509025], [-8.933579596304021, 42.34536155061658], [-8.934559089646896, 42.34365434724547], [-8.936350371648274, 42.344119395823896], [-8.939094140041734, 42.34297761719795], [-8.938059191899619, 42.34486780277358], [-8.938105514425441, 42.34638668295801], [-8.939467136717434, 42.34602785311908], [-8.939103856219235, 42.34757700790485], [-8.936459570853652, 42.349388790667874]]], [[[-8.922457941025465, 42.399760447095005], [-8.92093799425776, 42.3992271332395], [-8.92058518092988, 42.39613078707907], [-8.923197149403329, 42.39176452468029], [-8.928201716858773, 42.38753512682227], [-8.929769670494673, 42.38035133112544], [-8.933376949846517, 42.37509599669254], [-8.93312896003108, 42.37067102315868], [-8.936042921442365, 42.3657936728867], [-8.937155437313695, 42.357013148082984], [-8.93970863979756, 42.355134105807494], [-8.942158858518237, 42.35781523998109], [-8.9457948983321, 42.354682478008186], [-8.945221100341804, 42.35580156866214], [-8.947175908962635, 42.3567080171718], [-8.945424680144574, 42.35885156402415], [-8.949331040993382, 42.36126771581121], [-8.946201252148553, 42.36333904879229], [-8.947834701950853, 42.36418118595164], [-8.947978873469033, 42.36621710421301], [-8.945154645670183, 42.36908262072008], [-8.940469119380563, 42.367030909992664], [-8.940887321078183, 42.36914261318238], [-8.939355785144695, 42.37066252810924], [-8.940977025045706, 42.371118339652], [-8.941438307249397, 42.37381288821287], [-8.94506759083306, 42.377269748675985], [-8.94443599523726, 42.37880591599883], [-8.946447312381196, 42.37940338016003], [-8.9465961758002, 42.38071892317444], [-8.942621755889837, 42.383113175048855], [-8.941484001851292, 42.38687207568885], [-8.939914625284903, 42.387097725198736], [-8.938372108345781, 42.38580964273841], [-8.934940637380492, 42.387788317614856], [-8.93485869575454, 42.39205944666075], [-8.931896948462056, 42.393743577760695], [-8.933165987685793, 42.3940647522629], [-8.932166461013903, 42.39453973870821], [-8.932912020479344, 42.39844377599492], [-8.930687818782763, 42.39598478769671], [-8.929340770758024, 42.39535257377796], [-8.928194392893094, 42.396330257212036], [-8.925977751417909, 42.394590933084054], [-8.924518997886922, 42.398564339618254], [-8.922457941025465, 42.399760447095005]]], [[[-8.706618252427159, 42.410025223743425], [-8.70853791985219, 42.40762477787198], [-8.71194654486167, 42.40997501164619], [-8.71278140315476, 42.41260690775063], [-8.711112522899521, 42.41415767786049], [-8.708969257613704, 42.41476892262334], [-8.707293793605963, 42.41397942702636], [-8.705646703784966, 42.41163109292984], [-8.706618252427159, 42.410025223743425]]], [[[-8.842492639811363, 42.50037847462012], [-8.842390700789696, 42.4981152148057], [-8.843935194022523, 42.497460097980664], [-8.840928892987751, 42.494967315680775], [-8.841392663525385, 42.4926390906723], [-8.84261213191529, 42.489417050856694], [-8.843392567573622, 42.49061039498251], [-8.845522550369958, 42.48984426101212], [-8.846191350591655, 42.48710947496309], [-8.844484981843046, 42.48537839601084], [-8.847979970885335, 42.48139169773123], [-8.853118302875334, 42.48301889578314], [-8.853484916122317, 42.488887336842446], [-8.85178372616075, 42.49176510271538], [-8.846332037544226, 42.49486190616866], [-8.846924634578002, 42.49703699667039], [-8.844945218406606, 42.497984499707805], [-8.846941569617497, 42.499169620641524], [-8.84666052000232, 42.50032723284034], [-8.842492639811363, 42.50037847462012]]], [[[-8.899048308204378, 42.542399145109385], [-8.89845737305373, 42.5411694070534], [-8.901580531433023, 42.53956773419726], [-8.901628621843795, 42.537242795932016], [-8.904917772717598, 42.53984529707149], [-8.90461637266786, 42.541292188021124], [-8.903550476666306, 42.540447086231865], [-8.902329357173153, 42.541050340934895], [-8.902379447233272, 42.542353014898524], [-8.899988114875818, 42.54397091680394], [-8.898770438625252, 42.54370974894799], [-8.899048308204378, 42.542399145109385]]], [[[-8.915665150313876, 42.547669611999936], [-8.914787231277389, 42.546112782657126], [-8.912120853644478, 42.54546774817521], [-8.912276723923073, 42.54402838712698], [-8.913585356392828, 42.544734789134225], [-8.915550350112513, 42.54375980024304], [-8.916738479874997, 42.544607425774295], [-8.917419503472138, 42.547425671180264], [-8.915665150313876, 42.547669611999936]]], [[[-8.874977394974534, 42.573265240675845], [-8.874894432863762, 42.566824157797946], [-8.871321364054307, 42.56405535782863], [-8.86853730172928, 42.56358637585431], [-8.868547892866316, 42.56486407709662], [-8.867167735635288, 42.564043813731814], [-8.863704248713724, 42.56554499483882], [-8.863278300842765, 42.56852848889148], [-8.85670227812095, 42.566975634727136], [-8.855495671809955, 42.56476003064576], [-8.860557092740626, 42.56263694894083], [-8.857275568564056, 42.55738620464793], [-8.85976954691742, 42.55619603377635], [-8.859674353345175, 42.554274542936746], [-8.861118130162978, 42.5551276371088], [-8.862724255909308, 42.553559848095574], [-8.86096618192983, 42.54923017006245], [-8.853809610378581, 42.54717579299308], [-8.852336590703379, 42.545747999617234], [-8.85867003416237, 42.54590933524085], [-8.863655307601267, 42.54415910785638], [-8.864346711231798, 42.54478076470146], [-8.867260465131586, 42.54197553124911], [-8.86635383324489, 42.5301216689221], [-8.864299775158555, 42.52704048664304], [-8.865425827741895, 42.524516168744064], [-8.867689275036456, 42.5272354647655], [-8.869694607603789, 42.52681736000873], [-8.868","Galicia","12","Pontevedra","Pontevedra","36"]
[null,null,null,null,null,null,null,null,null,null,null,null,null,null,null,"Cu 3x 4 Mm2",4.6100000000000003,null,null,"40.8049892162, -6.06541224773",{"$cut":{"chars":32767,"head":"{\"coordinates\": [[[-6.475918255338319, 41.28733712567562], [-6.465351908046485, 41.286215250802094], [-6.454307080305131, 41.29207714095404], [-6.450892860591131, 41.290054360105614], [-6.445348357147617, 41.28385357066488], [-6.436805640204901, 41.28350590502206], [-6.423795768440776, 41.27969741761889], [-6.420835454863373, 41.2829015297396], [-6.416924314981996, 41.282765680721084], [-6.413927275580853, 41.280927486622566], [-6.415729363414584, 41.277028509004644], [-6.414731425863692, 41.27597745667255], [-6.404039745623533, 41.2788161129149], [-6.39136677443031, 41.27892050893705], [-6.38263308733632, 41.28571602288759], [-6.372275849876491, 41.28629952498005], [-6.365978035405352, 41.284565820791826], [-6.363176078642987, 41.28138773109869], [-6.354465282419096, 41.27914760211275], [-6.348291064453099, 41.27513989063566], [-6.347200845668024, 41.27249690262172], [-6.334921042820183, 41.271629024261024], [-6.327756587661847, 41.26806316763481], [-6.317682430009387, 41.27089398494303], [-6.311442380804322, 41.26340094517379], [-6.302950238113905, 41.2609164239298], [-6.296745254646045, 41.256438482701945], [-6.282275160607843, 41.25394362376563], [-6.277601687918425, 41.25475241467709], [-6.274261784929557, 41.2571710739826], [-6.268168738732641, 41.25560630163842], [-6.262805431770229, 41.25023797372772], [-6.254595884695192, 41.24544534962278], [-6.25110689999676, 41.24174351290433], [-6.238879099722535, 41.240098392205134], [-6.234132449371741, 41.23820556725293], [-6.231229760025022, 41.232811535807215], [-6.22518173918674, 41.22773084060315], [-6.210648450464991, 41.22327428797356], [-6.205218840648162, 41.220300637228426], [-6.199548670083011, 41.219720067761735], [-6.190928947757693, 41.21367334625312], [-6.181850150389569, 41.21091683768111], [-6.178440355776746, 41.20872360983407], [-6.163445848631944, 41.20740788410749], [-6.143558094166886, 41.1977852860499], [-6.134500400021449, 41.19038628771184], [-6.124989935209854, 41.19822830983985], [-6.124260372943413, 41.202940335001486], [-6.121149659828031, 41.2037272790867], [-6.109311808337234, 41.21261275892837], [-6.100397957825029, 41.21024164664875], [-6.092489970699377, 41.21249895417373], [-6.083639255581973, 41.211205587198954], [-6.074043793974876, 41.21131833997289], [-6.069468794606977, 41.216772234628245], [-6.065644458033219, 41.21763075263235], [-6.062011109577101, 41.2210508008934], [-6.058494577142205, 41.21470491911274], [-6.046720476392215, 41.209010319967426], [-6.040088919826954, 41.20822211615875], [-6.026089714576025, 41.20334965267794], [-6.021608440933353, 41.20340444283119], [-6.008834475746226, 41.20049702263419], [-6.010971250701915, 41.19378547887611], [-6.018237528999298, 41.19026275780575], [-6.023519028185286, 41.18481932019328], [-6.02376139724224, 41.182057012945386], [-6.027500410931951, 41.17912170787544], [-6.02819512126036, 41.166521630664825], [-6.025254954199965, 41.16168153525316], [-6.025855661223732, 41.160233742620655], [-6.021825399345828, 41.15526008595811], [-6.016286674764733, 41.15297374960706], [-6.009798504590099, 41.15206293377618], [-6.002566959653228, 41.15313449919913], [-5.985050562604088, 41.17334127488217], [-5.979218088925031, 41.17457324015633], [-5.974134184965565, 41.17259730583596], [-5.971435724903735, 41.168803332268304], [-5.972033584268053, 41.162258235874546], [-5.964295068812393, 41.15212759967432], [-5.963174762753608, 41.14604109865124], [-5.954372845020794, 41.142926118613985], [-5.953245182658081, 41.14010001720551], [-5.947005420914052, 41.1422954491553], [-5.945076435266747, 41.144182124217934], [-5.947691284633473, 41.147762782689945], [-5.94450421022739, 41.15029416283566], [-5.933867851835998, 41.15145748477069], [-5.937121963918531, 41.15841745710571], [-5.931643580971664, 41.15769260383668], [-5.930606419382226, 41.1595563271595], [-5.932565570456787, 41.166072076777695], [-5.926781071305521, 41.17106479067556], [-5.925041016633826, 41.17454949312005], [-5.922094196650498, 41.17583123791342], [-5.915590667081167, 41.17433004223949], [-5.914824607163021, 41.17721351678652], [-5.913134"}},"Castilla y León","07","Salamanca","Salamanca","37"]
[null,null,null,null,null,null,null,null,null,null,null,null,null,null,null,"Cu 3x 6 Mm2",3.08,null,null,"28.3125567678, -17.017856743","{\"coordinates\": [[[[-17.925108281249873, 27.849254052187405], [-17.92354204807376, 27.84816870744346], [-17.92277054454126, 27.84885935259087], [-17.921550029204777, 27.847110396618145], [-17.91723418330651, 27.84809710171474], [-17.91677958216612, 27.845416246760525], [-17.91558131465909, 27.845833993293745], [-17.91458006748169, 27.84336764711865], [-17.912823370763103, 27.84463385721611], [-17.91313237798029, 27.843445609371813], [-17.91141975881291, 27.842512038812238], [-17.90972551482823, 27.843691168865025], [-17.90809343507696, 27.842404060022332], [-17.90725413924407, 27.8434681712465], [-17.905941464713795, 27.840875260282747], [-17.901748749238223, 27.841714553706833], [-17.903850592503506, 27.840626145424245], [-17.903141652894202, 27.837716021585614], [-17.899739213925894, 27.837286935236502], [-17.899371146773674, 27.83607459008797], [-17.89868333487447, 27.83675662109219], [-17.898573696080586, 27.833265539092473], [-17.893993130720364, 27.832380708144985], [-17.89390089671835, 27.827454924237728], [-17.89247339320455, 27.82601218545843], [-17.895785684189352, 27.82392652177179], [-17.894058019191593, 27.823883850930503], [-17.89350527797426, 27.822219763541124], [-17.89250397708349, 27.822723401754498], [-17.88684672572158, 27.81838098569851], [-17.883500271366028, 27.813281927362], [-17.883330664226147, 27.80378630798125], [-17.885553837497657, 27.800212616436554], [-17.888685567932367, 27.800034340303533], [-17.892002281017394, 27.792876637288188], [-17.896739509702908, 27.78856900641239], [-17.895774130590965, 27.787601471053804], [-17.898083997793417, 27.78610962737694], [-17.89962308563679, 27.787286134903315], [-17.900727777163386, 27.784004089495557], [-17.901084210313403, 27.786707402039973], [-17.903564868978297, 27.785132993934017], [-17.90492861587895, 27.779452633686965], [-17.90707608369757, 27.777968615847833], [-17.90912606248438, 27.77366305908284], [-17.91438699882093, 27.770600045199348], [-17.909620773672188, 27.765274396046095], [-17.913700077494152, 27.762130302377873], [-17.9241180225347, 27.746809191933245], [-17.926801506150493, 27.73731651137896], [-17.925105097916077, 27.735207671098635], [-17.92666025295567, 27.734669617374838], [-17.927378851824024, 27.731930063721617], [-17.931660433999877, 27.72853995921893], [-17.937172667281782, 27.72772159568","Canarias","05","Santa Cruz de Tenerife","Santa Cruz de Tenerife","38"]
[null,null,null,null,null,null,null,null,null,null,null,null,null,null,null,"Cu 3x 10 Mm2",1.83,null,null,"41.1710254065, -4.05415057783",{"$cut":{"chars":29132,"head":"{\"coordinates\": [[[-3.963827913293567, 41.58608042088775], [-3.960492669866232, 41.57797487199247], [-3.953048545804084, 41.57343404126806], [-3.942238677815745, 41.569136485686315], [-3.931097002704244, 41.569199993819524], [-3.920777923881535, 41.56637361613826], [-3.914500008890916, 41.56345130889461], [-3.905558631303641, 41.556964647971064], [-3.894035137162109, 41.55179441160151], [-3.891897408195619, 41.54456919124314], [-3.886434300201987, 41.5360905141698], [-3.885783279437527, 41.532303494171856], [-3.882857821391684, 41.53402825116707], [-3.87513536961007, 41.53474468999381], [-3.867948266127125, 41.532475128607636], [-3.863706032385033, 41.528967168206705], [-3.852750464844167, 41.51255653479087], [-3.842726252623578, 41.50101088681296], [-3.834153670291423, 41.499641044602875], [-3.828236790010081, 41.49132494724854], [-3.823878802953715, 41.48113281073633], [-3.816136957443439, 41.483673931025926], [-3.800196585390429, 41.48586628624615], [-3.795256190890939, 41.48446830762421], [-3.787642681397126, 41.4858625588027], [-3.794293321772192, 41.490960141746285], [-3.798222498926035, 41.49192382600069], [-3.800436882034008, 41.49858285617852], [-3.796832235649581, 41.502625069136336], [-3.802213924837435, 41.51248664321235], [-3.804935042207329, 41.51448532409832], [-3.805017286564812, 41.51628616100763], [-3.804037682730641, 41.51557244777188], [-3.799060664815352, 41.5182100892142], [-3.800618878015591, 41.52114461709281], [-3.804060745178915, 41.52324637309959], [-3.803789556371079, 41.5245723301512], [-3.799114644580785, 41.521623426083984], [-3.796212587648052, 41.5224721506598], [-3.792467421397051, 41.52495685683062], [-3.784093565270357, 41.52731087480868], [-3.780920613278901, 41.53357433189445], [-3.773671796434235, 41.534893079249606], [-3.766191113635013, 41.53792434720891], [-3.771532688553867, 41.52234251365354], [-3.769694693261697, 41.51794121180112], [-3.770757288851706, 41.51659201619337], [-3.769781176769029, 41.511077140213196], [-3.767010392445478, 41.505772357803316], [-3.770863617940345, 41.49927953491495], [-3.768545738131847, 41.493746555653864], [-3.770443169556458, 41.49008597207052], [-3.769877312674149, 41.479722378258366], [-3.771638175921048, 41.47165816821385], [-3.769753622744334, 41.46015038108794], [-3.763742499308235, 41.46014526871429], [-3.757723503037024, 41.46151804909426], [-3.750036726948673, 41.46054144820446], [-3.744139320346054, 41.46105701184052], [-3.739484331392123, 41.45078259904974], [-3.729097162965811, 41.45762206721961], [-3.732408105168054, 41.46988703781149], [-3.723721343370033, 41.47920120809478], [-3.729056401011471, 41.48392352224598], [-3.727375307263544, 41.4867713232313], [-3.726561377920596, 41.495405382742625], [-3.728505985270598, 41.49895100769188], [-3.728189330929597, 41.50277198670395], [-3.724890991192489, 41.50784581669573], [-3.728307885190886, 41.51763310905792], [-3.717505743612348, 41.52378046574539], [-3.709734859162233, 41.52450398696503], [-3.706896897923397, 41.525854438683425], [-3.706920628718255, 41.530240747959475], [-3.699372494119281, 41.53391653110228], [-3.691551054281615, 41.53453100789922], [-3.689181827669789, 41.5405889146289], [-3.681544011561043, 41.55192010998329], [-3.675514770003977, 41.55444141815976], [-3.671727496122319, 41.560426155231205], [-3.669451399652688, 41.56067348584501], [-3.661051662164296, 41.56607200209882], [-3.658855029766371, 41.5658953817073], [-3.645255981754097, 41.5720968647671], [-3.62612834036061, 41.57000412390585], [-3.61684070984206, 41.57715159381534], [-3.608807981757975, 41.56611545812583], [-3.604701097179716, 41.56556953361541], [-3.600728670636506, 41.570472064808634], [-3.572629018206317, 41.56539035175057], [-3.571206783888912, 41.56868499311228], [-3.574526599649553, 41.572460504660874], [-3.570971830424654, 41.57742302999781], [-3.566519496907284, 41.57994882711826], [-3.562934748206443, 41.57742636106907], [-3.552958578785546, 41.58073504202206], [-3.54642709993294, 41.58008154519461], [-3.54157192231623, 41.57760041383994], [-3.543912674130138, 41.57206804596279], [-3.5366358"}},"Castilla y León","07","Segovia","Segovia","40"]
[null,null,null,null,null,null,null,null,null,null,null,null,null,null,null,"Cu 3x 16 Mm2",1.1499999999999999,null,null,"37.4356699135, -5.68277303032",{"$cut":{"chars":32767,"head":"{\"coordinates\": [[[-5.725075864605317, 38.19577687977107], [-5.723227636603774, 38.19244097522181], [-5.714729938731854, 38.18895289322632], [-5.713495958060363, 38.18585472225614], [-5.707878756656024, 38.18830005620469], [-5.705935130266213, 38.18513726779083], [-5.701015179625919, 38.18637684083896], [-5.698018937030553, 38.18499513782029], [-5.694730471575018, 38.18652130170128], [-5.694562294377432, 38.18350675401344], [-5.698790669809704, 38.182706812136566], [-5.697868326388347, 38.179673585149494], [-5.688612065937695, 38.18187722691494], [-5.687490533678483, 38.17962331118917], [-5.688836821726835, 38.17122203712369], [-5.684350964879631, 38.16156657797312], [-5.684061597763642, 38.15797762960384], [-5.684242917313855, 38.15706393595974], [-5.686142752630147, 38.16157065414422], [-5.69388419300033, 38.16819597515823], [-5.695006533743313, 38.1710895348449], [-5.701997520626761, 38.16723463358929], [-5.703894113024895, 38.16729009018873], [-5.70578602160715, 38.169381861744405], [-5.705561570346923, 38.16362051201418], [-5.694942886308822, 38.15138563000524], [-5.695257814087842, 38.149711506662136], [-5.704413526108784, 38.14335598899083], [-5.708970094741903, 38.14224179371289], [-5.715412302614958, 38.13383065082665], [-5.719781288643734, 38.136594772808856], [-5.730797472703521, 38.13710493180832], [-5.736002473156557, 38.135352942098976], [-5.738816699109041, 38.13281852171142], [-5.740737761615484, 38.12653866790492], [-5.738397010699895, 38.123115353657326], [-5.738267840148524, 38.11935209592671], [-5.735533009097487, 38.1157486549377], [-5.734101877865529, 38.10948389508815], [-5.734068673437658, 38.098194830195986], [-5.73605227485764, 38.0945175050561], [-5.734900599629055, 38.08625492424998], [-5.732895597644118, 38.08751797101495], [-5.719569225151251, 38.085070125852276], [-5.710426167697777, 38.08104663986104], [-5.693631281315321, 38.08373958064649], [-5.669355768727288, 38.10176477060392], [-5.667033427885071, 38.10907984085913], [-5.645958417720015, 38.12517149265037], [-5.643146762745929, 38.13038870998854], [-5.632500829211994, 38.138556973233534], [-5.605469878220408, 38.133942823054035], [-5.584788531372483, 38.131705746213655], [-5.580984971034697, 38.12800501994592], [-5.580504290610985, 38.119212398183855], [-5.581684254686165, 38.11547415600809], [-5.56174185570278, 38.108432117856005], [-5.557346317270854, 38.10796021475138], [-5.550840058619777, 38.101226681585196], [-5.546319277070921, 38.099432577779474], [-5.538781520708289, 38.09381094006126], [-5.539575177770256, 38.08215219293308], [-5.535400837798956, 38.079782448209684], [-5.532075309651383, 38.07590756370191], [-5.52685091726637, 38.07513699589102], [-5.525214036800021, 38.07327994966926], [-5.525612019217014, 38.0686129526053], [-5.523707666273109, 38.06593265764565], [-5.516099856589723, 38.06210412600704], [-5.513107409376483, 38.05924870974565], [-5.510428252313488, 38.05321479705918], [-5.495125677823857, 38.041844898980486], [-5.48996841564164, 38.03355634003218], [-5.489026005653495, 38.02893578418685], [-5.492036259272305, 38.01355385319957], [-5.490566742129936, 38.009169753718076], [-5.494247871077665, 37.99882853112654], [-5.493153350260709, 37.99576107704841], [-5.490344186314907, 37.99282904907528], [-5.487364735927215, 37.99361297424708], [-5.4852734830986, 37.99035028485854], [-5.481532833576769, 37.98949216995493], [-5.479065270187459, 37.98484963919337], [-5.476551327678254, 37.983217618596406], [-5.474648857603277, 37.975724669141066], [-5.470020234202859, 37.97449740116952], [-5.46893740585767, 37.970717610093985], [-5.457908177361748, 37.96902936790227], [-5.455144019909977, 37.96669024791165], [-5.452258003294974, 37.96718295406549], [-5.451632977079836, 37.96515957116638], [-5.447828170778748, 37.9633465369074], [-5.447264343190675, 37.96144797379122], [-5.435879607319355, 37.95824221202364], [-5.434172860381808, 37.955150779752174], [-5.42655701436989, 37.950235048670095], [-5.420627789439903, 37.94883437869336], [-5.419026496631853, 37.94546122511656], [-5.415611248346993, 37.94367516883421], [-5.414378"}},"Andalucía","01","Sevilla","Sevilla","41"]
[null,null,null,null,null,null,null,null,null,null,null,null,null,null,null,"Cu 3x 25 Mm2",0.72699999999999998,null,null,"41.6207742504, -2.58874304739",{"$cut":{"chars":32767,"head":"{\"coordinates\": [[[-2.344003620036013, 42.14550222362994], [-2.332149945620172, 42.14602815896366], [-2.32688615402518, 42.14367368687771], [-2.318204982443158, 42.14518045285089], [-2.307826719914579, 42.14024577267282], [-2.288390431762491, 42.13499310478652], [-2.282159706172072, 42.13170297822874], [-2.278913456144979, 42.12243297679121], [-2.282571452575778, 42.11882640403171], [-2.280614155624028, 42.11434695414033], [-2.281746001440986, 42.10839181388663], [-2.27161941092239, 42.09388161172262], [-2.269588688374273, 42.088554881655526], [-2.258890524094932, 42.0872792442038], [-2.254060539730394, 42.0918772262528], [-2.252770128689402, 42.09158060983269], [-2.237841913619787, 42.10221795412739], [-2.231316901738857, 42.10174200917274], [-2.224080183404464, 42.098153698796175], [-2.217095074197984, 42.09972732160828], [-2.208882602208754, 42.10466044101209], [-2.196876825049013, 42.1024243410403], [-2.188764428077317, 42.10315970126238], [-2.186159774589111, 42.104447190620625], [-2.182553615441817, 42.103664927804985], [-2.172772614897873, 42.105269958681404], [-2.165991026205539, 42.104085945959916], [-2.158880512185355, 42.10492554724154], [-2.14925633143894, 42.10380075626372], [-2.14811076924587, 42.10444969925686], [-2.138633492692759, 42.10231634884002], [-2.136748458917431, 42.10308572293745], [-2.127323818250086, 42.09716913562633], [-2.128678288153981, 42.09099205519077], [-2.126820314329936, 42.088050872033065], [-2.127238905896154, 42.080461637640404], [-2.135406333662131, 42.07463336982677], [-2.142618451632477, 42.074093195719], [-2.146333210809432, 42.07293203473589], [-2.152034840375635, 42.06870531714888], [-2.161912246319265, 42.0667335248238], [-2.161121398289176, 42.06254877005582], [-2.158371822291122, 42.059340343835274], [-2.158998035180744, 42.05585942390969], [-2.156782159072778, 42.053447390905845], [-2.154764558215991, 42.04703795064501], [-2.149921675840616, 42.04502968990193], [-2.150564159914981, 42.042161361990146], [-2.144893001203191, 42.0415968211124], [-2.128901329059226, 42.026183347736186], [-2.120693907398499, 42.023950058248474], [-2.119678794957805, 42.022240057102636], [-2.117007454136133, 42.02150799679576], [-2.115238671341683, 42.011452024938976], [-2.107631106000163, 42.00277385705299], [-2.112106578322624, 41.997017400906586], [-2.119422775101826, 41.99706483789225], [-2.124071185692861, 41.99530811300225], [-2.119899414005046, 41.986143521721274], [-2.119306267202713, 41.97663703799631], [-2.116291380073674, 41.9747044139015], [-2.115026774037507, 41.964931491197454], [-2.116095552731637, 41.96357076285291], [-2.109960178817053, 41.95786712304196], [-2.100439985251215, 41.9552710268006], [-2.095935093103187, 41.956424449640785], [-2.092644034211426, 41.95536269887149], [-2.09112195933677, 41.95633235623007], [-2.086226627925182, 41.95439306016293], [-2.080121906324732, 41.95435326869489], [-2.078367685221033, 41.95133097788225], [-2.076214448637851, 41.950881360617785], [-2.069568880150884, 41.95237672787956], [-2.067616181675054, 41.95390103390528], [-2.063252452587352, 41.95362228920146], [-2.062239023589452, 41.954433563086006], [-2.054579575150354, 41.95265043606973], [-2.052132524790546, 41.950864964935214], [-2.046641975959908, 41.95092751516649], [-2.044104951239574, 41.945502457927944], [-2.037409834376478, 41.94146553615454], [-2.036391355948368, 41.93940346001288], [-2.036100130218123, 41.943517058676235], [-2.033501578985625, 41.94383742963477], [-2.034744559877995, 41.94620766875588], [-2.030650878737719, 41.948055508034344], [-2.031352851046801, 41.94950247372088], [-2.029735146018539, 41.9503624516876], [-2.029899332001375, 41.953056784634335], [-2.028313706710216, 41.953385616826424], [-2.020952846593425, 41.94792809216819], [-2.019557999214096, 41.944475637066766], [-2.016090057551323, 41.94484228510415], [-2.013075992380805, 41.94080842999293], [-2.004655363672216, 41.94006019576561], [-2.001338142246156, 41.93850928825859], [-1.998663645642935, 41.93443300127155], [-1.998348036042586, 41.930710483172284], [-1.984115531126221, 41.92008365166516], [-1.9"}},"Castilla y León","07","Soria","Soria","42"]
[null,null,null,null,null,null,null,null,null,null,null,null,null,null,null,"Cu 3x 35 Mm2",0.52400000000000002,null,null,"41.0876143957, 0.818127863314",{"$cut":{"chars":32767,"head":"{\"coordinates\": [[[[0.852078841098488, 40.72510635069053], [0.852669599280517, 40.725086618759825], [0.853204023212778, 40.724508698113866], [0.852078841098488, 40.72510635069053]]], [[[0.864120549972614, 40.72535889015797], [0.863286986152366, 40.72487463220828], [0.860083356693607, 40.72902607216723], [0.857371404834328, 40.730075717610454], [0.861152861226619, 40.729510854032874], [0.864120549972614, 40.72535889015797]]], [[[0.738056742085243, 40.786236444133095], [0.737409293022276, 40.78631149375901], [0.737019900296038, 40.78697252480107], [0.738056742085243, 40.786236444133095]]], [[[1.633586989374347, 41.313481283730084], [1.642852254540276, 41.31294397783096], [1.64028449665666, 41.31041968516963], [1.635681884872242, 41.30950817692385], [1.629325208290345, 41.310645270604084], [1.633586989374347, 41.313481283730084]]], [[[1.438917100460647, 41.5756741199372], [1.447830058947731, 41.57380727225434], [1.454837635919576, 41.56917746572869], [1.439964814560114, 41.562982803622475], [1.431382555573718, 41.555652004078404], [1.432698757246996, 41.551414264255854], [1.434869423842158, 41.55020489175757], [1.438046288895792, 41.55003707518133], [1.447077001245208, 41.55237966305316], [1.449641508125828, 41.545392159180516], [1.448937643066349, 41.53706363380855], [1.436538709236323, 41.53922738892999], [1.425957015124364, 41.53186543504168], [1.409077000788498, 41.534919549677326], [1.406422717176846, 41.533598864190836], [1.405055205531407, 41.530581032765774], [1.40297523733887, 41.53083193209046], [1.402107001243575, 41.529163473919574], [1.399893827267477, 41.528510058039956], [1.401030311086524, 41.52707078599142], [1.399815309121825, 41.52382193860554], [1.400883150873387, 41.52119677890945], [1.398329835204799, 41.51976397460137], [1.398970030372028, 41.514012827609214], [1.396701229120274, 41.51288426180108], [1.401293353971712, 41.51205985373834], [1.404959412783068, 41.506597700975135], [1.408332540861665, 41.50511750218854], [1.415678195197393, 41.5053392137363], [1.419112979145589, 41.50230762064262], [1.422177868300591, 41.503342029254064], [1.422896318407202, 41.49964963695796], [1.437343281728094, 41.49829059964037], [1.446398344710101, 41.49480682483166], [1.450122775150396, 41.49218639085813], [1.452308845157866, 41.48634812599285], [1.453897229175642, 41.4876821152265], [1.460368456227104, 41.48827718460772], [1.464314266587738, 41.486800196880694], [1.465961227948655, 41.48393588798336], [1.474286950547898, 41.486249773692016], [1.476525001569295, 41.48258793604086], [1.475028047182909, 41.4794589357562], [1.479942016841286, 41.47606183012702], [1.484914950118333, 41.47491321206609], [1.487525167772232, 41.46625746922855], [1.483531319103575, 41.45782381021252], [1.479586620857343, 41.452863584027256], [1.468836973228107, 41.44395459522278], [1.476013271776808, 41.43608460797176], [1.495554270258491, 41.43559994723895], [1.491526544323666, 41.43531645607668], [1.483690153822694, 41.43029254568902], [1.478035476499925, 41.43313346220772], [1.475448460533467, 41.429443717127306], [1.477429163090544, 41.423459861885526], [1.484147626271304, 41.422180098130305], [1.482105716104198, 41.41667744662901], [1.485110626544487, 41.41393987125272], [1.49051776949758, 41.40147402911982], [1.488969368594809, 41.400003919794784], [1.482809702436673, 41.39859698512236], [1.48065769923991, 41.387831231646786], [1.474058717381999, 41.382794200160816], [1.47339225278101, 41.38074920297652], [1.474805119466935, 41.38252200014081], [1.477848642193035, 41.38297054708096], [1.478882183572095, 41.38183169007132], [1.484829712575821, 41.382265715967705], [1.494484074023342, 41.38964064183362], [1.496148023424545, 41.38932331874097], [1.502852759449497, 41.39187871419305], [1.505547891253828, 41.39143077121393], [1.509641565208611, 41.394430393757915], [1.512216662328015, 41.39432016684733], [1.519210046816955, 41.388786657979466], [1.531445433366707, 41.38764690267063], [1.537167714304633, 41.385349867734654], [1.542130263057181, 41.380732463969345], [1.546132417549221, 41.37932239103773], [1.547861307959012, 41.376174458839"}},"Cataluña","09","Tarragona","Tarragona","43"]
[null,null,null,null,null,null,null,null,null,null,null,null,null,null,null,"Cu 3x 50 Mm2",0.38700000000000001,null,null,"40.6612619615, -0.815532258446",{"$cut":{"chars":32767,"head":"{\"coordinates\": [[[-0.558551073640885, 41.35383334464569], [-0.55359422380201, 41.34709244684356], [-0.550666008826555, 41.34549897676766], [-0.546254026733329, 41.34682060120215], [-0.546052826567589, 41.348049075161825], [-0.54501291433677, 41.34739641888643], [-0.543412202738755, 41.34896653107773], [-0.539111880337042, 41.349223506161586], [-0.535754388335074, 41.34792724792571], [-0.530243917566393, 41.349196551214696], [-0.522542602245065, 41.348372169933526], [-0.521447237011764, 41.350465119667554], [-0.510146696638778, 41.354059905222904], [-0.507449867019272, 41.35329782396458], [-0.506470474289193, 41.354222276736564], [-0.50244584844143, 41.354117985068065], [-0.502990914714792, 41.353319210701855], [-0.500283626908736, 41.35222462096589], [-0.498592384893002, 41.35300687503367], [-0.493300301756358, 41.35074685624539], [-0.489075497127315, 41.35026901379244], [-0.486077331239054, 41.34771539307514], [-0.479931000572851, 41.345934303196024], [-0.477071028812855, 41.329307847688035], [-0.4701625890192, 41.3182490278575], [-0.459773021192694, 41.315993384644095], [-0.459260141555931, 41.318431785106554], [-0.443344098575603, 41.313008150790026], [-0.424270139605013, 41.313527876019045], [-0.424227829853455, 41.31217602082106], [-0.420757004598564, 41.31173786086055], [-0.423545907043168, 41.309170507841415], [-0.426595458362352, 41.308473244063514], [-0.424721920327714, 41.30508984280096], [-0.426983084102445, 41.30287083696155], [-0.425725473247341, 41.29779900111678], [-0.428750432287387, 41.29406595178626], [-0.419938772325386, 41.284933921986784], [-0.411310286036375, 41.27908375565413], [-0.405857710789397, 41.2723590510323], [-0.385850876549016, 41.26543915876664], [-0.38163180137485, 41.26467663580129], [-0.377936896762252, 41.265456789683434], [-0.372329571436222, 41.262997454660855], [-0.358075523122613, 41.25296913397388], [-0.346726181771741, 41.246783290075406], [-0.344585459618761, 41.246902755986106], [-0.337207692309945, 41.24138468025717], [-0.330555316389676, 41.2444530951351], [-0.323076225405005, 41.24555988662825], [-0.322531124097365, 41.24984213714604], [-0.324560327594376, 41.25364393991774], [-0.323753059259208, 41.255282902269805], [-0.3180837169409, 41.257610722186804], [-0.313307736596219, 41.25563326760901], [-0.278616607733444, 41.226799464997065], [-0.270467186697228, 41.2162321680068], [-0.268669276928005, 41.21501021524032], [-0.246410623188437, 41.21192076314238], [-0.24316064425457, 41.209789465932246], [-0.230866966029216, 41.19447161185687], [-0.224186073090233, 41.1894832711854], [-0.222471850372865, 41.188856462215305], [-0.205467743665776, 41.19201133915607], [-0.180952883055171, 41.18814412702417], [-0.150474514209984, 41.174244159019295], [-0.132602899043053, 41.1614975167687], [-0.122399721756398, 41.156640589197046], [-0.103499707167322, 41.149618816654446], [-0.094996509809233, 41.1489811841057], [-0.083742212012007, 41.1512723661499], [-0.079692763017953, 41.15096256275016], [-0.07094844436286, 41.14370630809561], [-0.053292132911595, 41.13864431072575], [-0.043340846823901, 41.133957967630764], [-0.038273019114707, 41.12904525105662], [-0.025785583265647, 41.128083773123215], [-0.012229390282003, 41.12024890999186], [-0.007929446070981, 41.10217790822421], [-0.000654940103951, 41.09040635781453], [0.011356824327455, 41.07895181519116], [0.013124212038311, 41.07465457814973], [0.018994652114555, 41.068223287690046], [0.024694625187474, 41.06536272392772], [0.026134741368951, 41.0614791292304], [0.036919448444795, 41.04656850025381], [0.041027060658511, 41.048180531850555], [0.046161479581427, 41.05322344460467], [0.049614447226777, 41.053023911772925], [0.051827254689802, 41.05482058370831], [0.05101527379265, 41.059129202270796], [0.055702173600529, 41.06629099200012], [0.05467098670612, 41.06843487710191], [0.057536469630386, 41.07505054314842], [0.060796382134629, 41.076819212134986], [0.078635372287281, 41.08034221381214], [0.09322864870696, 41.08010412483456], [0.11825910725674, 41.076825859975216], [0.135925043258124, 41.06789797080738], [0.144536697813849, 41."}},"Aragón","02","Teruel","Teruel","44"]
[null,null,null,null,null,null,null,null,null,null,null,null,null,null,null,"Cu 3x 70 Mm2",0.26800000000000002,null,null,"39.7937341614, -4.14815562595",{"$cut":{"chars":32767,"head":"{\"coordinates\": [[[-4.373200998592973, 40.31427926921849], [-4.364852197377857, 40.31404471802957], [-4.363096376374672, 40.31158794565654], [-4.356902771866717, 40.30965176591076], [-4.356386757109649, 40.30862077881996], [-4.358653061942724, 40.29377258279071], [-4.356793004925509, 40.28449030570629], [-4.35832240017145, 40.275629560136075], [-4.356858952047115, 40.27026701472046], [-4.350695238081954, 40.26277132009476], [-4.347885115633725, 40.25603711486115], [-4.344759312618284, 40.25329697614814], [-4.34793027843463, 40.24388456419893], [-4.348217282981438, 40.23684460209364], [-4.341705583234763, 40.240468188611814], [-4.333350799239827, 40.238255995247975], [-4.326469680807291, 40.23350307577053], [-4.326346711326336, 40.231728451001835], [-4.321475962312565, 40.22645522225609], [-4.3111488588394, 40.234578898988154], [-4.307964058069356, 40.2338686038548], [-4.305843834572833, 40.23214660015588], [-4.309723445384198, 40.22643810108454], [-4.306764065156569, 40.221964021858156], [-4.295470548710888, 40.21873495661784], [-4.291193055195544, 40.22146646423035], [-4.286733566596905, 40.22788753905351], [-4.275615661806144, 40.231584861762], [-4.269691621951993, 40.235977377717454], [-4.267385957434765, 40.24269727316431], [-4.261974761284734, 40.24764926492543], [-4.260345562312421, 40.25742950005054], [-4.253766046049962, 40.26281395712259], [-4.249381384419589, 40.27265249405336], [-4.245988708102854, 40.27421319806071], [-4.234086807631011, 40.274131507802146], [-4.231480989926151, 40.27666610994236], [-4.228352697679098, 40.275098643811305], [-4.22844636770873, 40.27253907292559], [-4.226195616306423, 40.269893554074784], [-4.221664484368985, 40.27109552583603], [-4.220988744662768, 40.2726270049362], [-4.219657962434602, 40.27200861211682], [-4.217565469032593, 40.27285496320973], [-4.213745477609982, 40.26944555197632], [-4.208839327787419, 40.26822392815377], [-4.2032305292244, 40.26881750316403], [-4.204824931055842, 40.270651359737585], [-4.203165960118382, 40.27519929224053], [-4.204737934610509, 40.283317240973155], [-4.203841555195812, 40.28718357092908], [-4.20202451939593, 40.28927434715949], [-4.198971216712028, 40.2902311918355], [-4.197105839871801, 40.294127998988316], [-4.190871468917901, 40.29735456722961], [-4.18443280759373, 40.2943026241292], [-4.17962805960043, 40.2933696719072], [-4.176389535084841, 40.28979723513574], [-4.172486132393137, 40.28809989287463], [-4.172500898001439, 40.28282490590271], [-4.166967890298976, 40.27279517577024], [-4.163743221398261, 40.26993573423526], [-4.160678928725289, 40.269561110649995], [-4.157958076358421, 40.27070547658973], [-4.149093058265284, 40.2660190366089], [-4.147104612231096, 40.26666039963052], [-4.144077050771715, 40.26426689586059], [-4.144846776714505, 40.258997946739235], [-4.150726880866416, 40.24923231804846], [-4.145769681582882, 40.2451769171925], [-4.143728771241147, 40.24482952525546], [-4.131467205990766, 40.248980747163365], [-4.128125987868519, 40.24630614003038], [-4.124451121076659, 40.24604817885707], [-4.120462114328253, 40.24356069298174], [-4.111500699818633, 40.24410654966406], [-4.104244508703814, 40.24179758081432], [-4.099684247096612, 40.24695818318], [-4.087234784831484, 40.25418980313615], [-4.080456468701755, 40.266939610755664], [-4.075375468097369, 40.2652076151221], [-4.072894296129829, 40.26545130861989], [-4.052086043383676, 40.2515285668976], [-4.041869742609225, 40.2497091899878], [-4.023768191069237, 40.249019307878335], [-4.026641216248564, 40.244739733896964], [-4.026158995214195, 40.23561047164768], [-4.022103576016851, 40.23358773998172], [-4.020609388441831, 40.230835100044494], [-4.008803180107306, 40.219815721945025], [-4.006174442786307, 40.21824935667704], [-4.001223222689349, 40.2175415017113], [-3.991002592035254, 40.20947816819364], [-3.976927313853216, 40.2119284202473], [-3.962104575370983, 40.21228677595236], [-3.95618566310051, 40.211464573044196], [-3.95291694890317, 40.21233929924101], [-3.956297738711967, 40.19908508779354], [-3.950752221070825, 40.196813494954206], [-3.949151401674968, 40.1"}},"Castilla - La Mancha","08","Toledo","Toledo","45"]
[null,null,null,null,null,null,null,null,null,null,null,null,null,null,null,"Cu 3x 95 Mm2",0.193,null,null,"39.3702562375, -0.800789615081",{"$cut":{"chars":32767,"head":"{\"coordinates\": [[[[-0.987141629168891, 39.980724854021794], [-0.984362563276702, 39.97846038892427], [-0.977932887800253, 39.97610514861949], [-0.967291361401257, 39.97404506313527], [-0.953242201736061, 39.96731133866786], [-0.949204289805259, 39.96726695105111], [-0.944548533690085, 39.96283322910645], [-0.934790379998738, 39.95992099279651], [-0.931885924564181, 39.956076533966865], [-0.924888883035791, 39.959068378933324], [-0.920454322686286, 39.964403103992396], [-0.918504792568507, 39.96267443673146], [-0.915758281622131, 39.95789549824266], [-0.917184172981057, 39.95488523001319], [-0.911641384421698, 39.95084860306854], [-0.91054177734367, 39.948135198232926], [-0.906034277386305, 39.94395483518512], [-0.906755504185226, 39.94256257204687], [-0.904926482164516, 39.94036741281607], [-0.904371414947034, 39.93478103769517], [-0.902658678941543, 39.93184928527292], [-0.903487143025752, 39.92617984259198], [-0.905706582750488, 39.92630105799831], [-0.907610225126901, 39.92795695426368], [-0.912045199599818, 39.922559704678456], [-0.913821466258873, 39.9180062538706], [-0.911679131629973, 39.91420208611208], [-0.912071416033047, 39.91014616002972], [-0.907608512039664, 39.90073274312449], [-0.909614758191285, 39.89860685214809], [-0.902959075572484, 39.89709034392788], [-0.900242406659938, 39.89183414403025], [-0.903707993838392, 39.88786997665241], [-0.908149307722199, 39.88603130871418], [-0.908551716138585, 39.88048926723779], [-0.912788047050995, 39.873052352020665], [-0.907774452432208, 39.8656740778164], [-0.889978883247623, 39.85431619208085], [-0.888573740276819, 39.85211056590127], [-0.879287988135501, 39.85228352195721], [-0.874033056624143, 39.84834070897831], [-0.870196123873542, 39.848828854690694], [-0.867419545416366, 39.84677796389074], [-0.863554843045424, 39.84740954495581], [-0.858046992662417, 39.8505150729216], [-0.858460172777345, 39.85226130878359], [-0.857157527580498, 39.851678752119604], [-0.857837914271603, 39.85385339858759], [-0.856454056881464, 39.85550340300493], [-0.848687616397013, 39.857161342827695], [-0.844331291223893, 39.86040461572674], [-0.838793190972075, 39.86254462010855], [-0.828737172102166, 39.871149071741485], [-0.821014485860292, 39.87319320390453], [-0.814983010193116, 39.87351211563609], [-0.808171607314776, 39.87739226321092], [-0.79769438008623, 39.88106734397208], [-0.793130149722037, 39.881187752717445], [-0.77921609667557, 39.87210269888933], [-0.773561786765287, 39.869796205600345], [-0.764199847606393, 39.858553632761804], [-0.762660390330901, 39.85448816470692], [-0.754037762854267, 39.84326813598191], [-0.748680017361944, 39.840209396144495], [-0.745167768094391, 39.835762995034024], [-0.745210297034897, 39.83196229590943], [-0.740684151645511, 39.832090308700025], [-0.737195138201101, 39.82980605002827], [-0.737551305838247, 39.82215557006382], [-0.735909884388161, 39.81948394062243], [-0.730676076760628, 39.81663387587045], [-0.730455190015409, 39.81482776214777], [-0.727512896642829, 39.816193516234996], [-0.72588503436362, 39.81418864798412], [-0.722517103938055, 39.813230645963536], [-0.71254924662848, 39.81684502194877], [-0.707046245351367, 39.83513198285082], [-0.702238428713049, 39.83948697384495], [-0.695118599163406, 39.850056546232466], [-0.691110708929368, 39.85246303806614], [-0.668550994703994, 39.84039941569122], [-0.656150771794526, 39.835960280818966], [-0.652261540924681, 39.822855101973474], [-0.651032349171982, 39.81194772559634], [-0.644706725554866, 39.791585917756365], [-0.647715856279537, 39.787926403683336], [-0.649079903122707, 39.77083753585401], [-0.652345690608907, 39.75408519414014], [-0.631008604146423, 39.74633460259403], [-0.588223330282062, 39.74168829188788], [-0.577147815192848, 39.768024482782536], [-0.577047897380428, 39.773202410037776], [-0.558549395587582, 39.79054312112347], [-0.548404147060503, 39.79573399279967], [-0.530585790311973, 39.79597730778917], [-0.520850026230716, 39.784473037106984], [-0.51384904469145, 39.77914329980127], [-0.513511969847362, 39.77585701822531], [-0.50852387211133, 39.77075917487023], ["}},"Comunitat Valenciana","10","València","Valencia","46"]
[null,null,null,null,null,null,null,null,null,null,null,null,null,null,null,"Cu 3x 120 Mm2",0.153,null,null,"41.6341260695, -4.84719141141",{"$cut":{"chars":32767,"head":"{\"coordinates\": [[[[-5.516732151072739, 42.093450196225135], [-5.510412754577169, 42.09294931186735], [-5.510221231961935, 42.09116137785199], [-5.498464839701438, 42.08367325598953], [-5.490924865398448, 42.075128791769394], [-5.485161830592644, 42.06623011611559], [-5.483364730205503, 42.05982093077762], [-5.47709487130627, 42.05646234314507], [-5.480925505070125, 42.05242601971691], [-5.464212372565143, 42.04364552313658], [-5.454637885721814, 42.040680850185765], [-5.438677322236015, 42.031502232876356], [-5.430493880203423, 42.035161130806074], [-5.424774042684717, 42.03564243579681], [-5.421589240118002, 42.03067552687071], [-5.447438449268267, 42.013655341713104], [-5.44780917679951, 42.01072960679985], [-5.443098270414094, 42.01195573295571], [-5.436380865450409, 42.009027669776714], [-5.431455844718657, 42.004323027756946], [-5.433466657006877, 41.99341041675243], [-5.4335191797049, 41.98307075202], [-5.438279779993592, 41.96738964184686], [-5.447034202000568, 41.97288587969024], [-5.456159035331786, 41.9757348629642], [-5.460802595020358, 41.97471678169715], [-5.463124385195322, 41.97545945210386], [-5.462786625835014, 41.977655093909746], [-5.46698215975881, 41.978159362644156], [-5.484804743979011, 41.984565072093744], [-5.488407066421804, 41.99553699802282], [-5.484100012045321, 41.99623369312498], [-5.479086521631122, 41.99926007114739], [-5.478454141807124, 42.004425002686446], [-5.471728351070256, 42.00629018305266], [-5.471417054281618, 42.010097336018944], [-5.472807899666346, 42.01357956909836], [-5.487669816373109, 42.025857281009465], [-5.488265145183264, 42.029968963762585], [-5.492707555011775, 42.033294660627256], [-5.486508072826853, 42.03880561870206], [-5.495846074578409, 42.04557321398179], [-5.496217535134901, 42.049194425956934], [-5.507745866704388, 42.057507311024224], [-5.502868533039488, 42.06254896813155], [-5.501586529331203, 42.066521439990076], [-5.509046788932561, 42.07702116379746], [-5.518392642857997, 42.08469628995902], [-5.517950277377784, 42.09062269502343], [-5.520892828566844, 42.09714116684671], [-5.516732151072739, 42.093450196225135]]], [[[-5.322061227358399, 42.2677294211143], [-5.320319624889522, 42.267188338155435], [-5.30643942126127, 42.271584091801756], [-5.301758354214619, 42.26923770890335], [-5.30068358106263, 42.265359833261094], [-5.303928809705212, 42.256928448123574], [-5.303324911865571, 42.251996484762735], [-5.306093322840161, 42.24946425897648], [-5.307230575616869, 42.24940532798539], [-5.309050096156834, 42.252097406156], [-5.31676347315742, 42.24955525399986], [-5.31644259314132, 42.241123398992904], [-5.327298905826443, 42.238733100027574], [-5.332836941399665, 42.238719567222105], [-5.336257079214596, 42.23353470698495], [-5.335599772039759, 42.230828395974], [-5.337114303760992, 42.230824524793164], [-5.341317656621031, 42.23274701509244], [-5.34057357308804, 42.24670294004877], [-5.346043365445733, 42.251039883192924], [-5.346600356854493, 42.253964317083074], [-5.346031466361469, 42.25725400126224], [-5.347171582967264, 42.2592298751446], [-5.345408959022386, 42.262697136978204], [-5.345342536692009, 42.267768648727], [-5.341365879083781, 42.268759523081116], [-5.337192587446401, 42.2696822119672], [-5.328505566035211, 42.2741457281882], [-5.322061227358399, 42.2677294211143]]], [[[-5.112002331710895, 42.3118414817861], [-5.109587468886036, 42.31183191989503], [-5.108783511741003, 42.310648953163245], [-5.0937539765888, 42.30929447587731], [-5.087054503794906, 42.297484196210306], [-5.086165364801435, 42.29223204499333], [-5.082405775200204, 42.29372328966416], [-5.077896701394494, 42.29160781160899], [-5.078976031699925, 42.2897600739579], [-5.075423971793941, 42.28501542384369], [-5.07643060593501, 42.282799818017935], [-5.07515000719187, 42.27888754796848], [-5.071876815791081, 42.277812018131826], [-5.070708148030612, 42.27915696974091], [-5.066112184679064, 42.27619600799908], [-5.062189747584824, 42.277887647962494], [-5.066256067838107, 42.26650332089061], [-5.065375104412007, 42.265888759097024], [-5.068192047768155, 42.26119097573096], [-"}},"Castilla y León","07","Valladolid","Valladolid","47"]
[null,null,null,null,null,null,null,null,null,null,null,null,null,null,null,"Cu 3x 150 Mm2",0.124,null,null,"41.7271743961, -5.98053925522",{"$cut":{"chars":32767,"head":"{\"coordinates\": [[[-6.761139055177893, 42.23986633981577], [-6.759092374956928, 42.23866392094476], [-6.755739878485987, 42.23954830587471], [-6.753274271627175, 42.238431514238485], [-6.742992516905339, 42.24017269781747], [-6.737383510831036, 42.236096753911546], [-6.734846080071938, 42.23560327683555], [-6.733017876416313, 42.23172786505152], [-6.735483632395459, 42.23018876991865], [-6.735447712360537, 42.22793882269654], [-6.733290093795224, 42.22402019375438], [-6.72748802180006, 42.22259736604211], [-6.725221928969199, 42.22340944285519], [-6.722861814867438, 42.21974026894299], [-6.723723528295444, 42.21688490074153], [-6.721141038041694, 42.213961287078874], [-6.716389517025274, 42.213287176093225], [-6.711468020384054, 42.21404998469179], [-6.703793291601374, 42.20937298410867], [-6.699129479394371, 42.20977580893777], [-6.689317121358084, 42.21473865673325], [-6.674389798314457, 42.21446209289647], [-6.670957098458347, 42.212501087864844], [-6.659149456411818, 42.2137973857193], [-6.654780088598786, 42.21301843095254], [-6.647953613786119, 42.216891859760615], [-6.638649330298221, 42.2172958661008], [-6.629938087611537, 42.211989400670795], [-6.623456379916761, 42.21217664114048], [-6.621095926251887, 42.20987401993103], [-6.618815191780247, 42.20938785595653], [-6.616228969924918, 42.2043999202552], [-6.613266738444404, 42.20321475878954], [-6.607120525457195, 42.20587575167735], [-6.603864528709068, 42.203997158963936], [-6.597176435772774, 42.20352305276616], [-6.593622038450163, 42.206408048860354], [-6.587643269635376, 42.20798216774258], [-6.581788329090838, 42.20618434674321], [-6.5779613290121, 42.20661914872063], [-6.573710290881619, 42.2049058910491], [-6.557762263384764, 42.2071132190082], [-6.530801505849989, 42.202778649734896], [-6.526001421011121, 42.20335876897553], [-6.521030127160494, 42.20020691025938], [-6.518765586618564, 42.20064569361828], [-6.507650668725486, 42.19544863190628], [-6.506056935240484, 42.19400260602995], [-6.506611720386925, 42.19068090219632], [-6.504280243678203, 42.18924846173924], [-6.508295104838985, 42.18434404505504], [-6.499862373128129, 42.18380057484126], [-6.497560754622812, 42.1820248601962], [-6.495682599247469, 42.18287458298254], [-6.492014671042741, 42.182446127782214], [-6.490446313167864, 42.18408777077333], [-6.47824859118405, 42.18222551871135], [-6.468810228750243, 42.19293930495833], [-6.465433436444274, 42.19474338414409], [-6.461437833366539, 42.19519734218076], [-6.459860924428527, 42.19714500325118], [-6.453087837391673, 42.19663792478899], [-6.449623836637921, 42.1946262152272], [-6.444878689168561, 42.194660878156434], [-6.442213897963517, 42.19353435084527], [-6.438018577838579, 42.19834282179215], [-6.427895207779819, 42.201941882074095], [-6.422949415303562, 42.19894708504442], [-6.409839624828672, 42.19568202409476], [-6.402867075866236, 42.19618642686546], [-6.402435586289154, 42.19739691679515], [-6.398404895914761, 42.19788573787733], [-6.397495122619167, 42.20079428075783], [-6.38158583137592, 42.20314689695408], [-6.380492491843577, 42.201495253953766], [-6.347123816028705, 42.20052974480448], [-6.341708625070385, 42.20509116622999], [-6.329455338693212, 42.199864759248385], [-6.323532613074097, 42.20354859962907], [-6.320660126883805, 42.20235316492826], [-6.317406064208585, 42.20520292782759], [-6.312585149235023, 42.20658506792763], [-6.310280012927048, 42.20604836188295], [-6.306932631463494, 42.20294823463838], [-6.303073765446821, 42.19211845962328], [-6.298477689805733, 42.18361503421289], [-6.294254318887736, 42.182259705169756], [-6.293732059941112, 42.1780333407776], [-6.277871599320209, 42.17895628607463], [-6.251963016918827, 42.17305760808819], [-6.254124026624263, 42.167043891753565], [-6.242206930250657, 42.16763378226932], [-6.225818795638654, 42.1619546922063], [-6.222474727161841, 42.15878891369126], [-6.218701386150179, 42.15097044497545], [-6.212395181414409, 42.14807659806284], [-6.170388725340809, 42.15817914967516], [-6.160213091298927, 42.165772268116925], [-6.154048581426278, 42.16132243985972], [-6.14340661485"}},"Castilla y León","07","Zamora","Zamora","49"]
[null,null,null,null,null,null,null,null,null,null,null,null,null,null,null,"Cu 3x 185 Mm2",9.9099999999999994E-2,null,null,"41.6203648019, -1.06449678144",{"$cut":{"chars":32767,"head":"{\"coordinates\": [[[-0.915798877388363, 42.74380660662229], [-0.909105967685905, 42.744036445054206], [-0.901087061080816, 42.742719002739], [-0.900961153210609, 42.73776396787696], [-0.896866507279735, 42.735662674080615], [-0.90684607502734, 42.726606605940546], [-0.904174584187039, 42.717804934020364], [-0.904351552298012, 42.71218904406583], [-0.907203838970722, 42.710161128678905], [-0.911787887068371, 42.70928130321752], [-0.915578365240612, 42.704748857675014], [-0.922511929116125, 42.70076867015763], [-0.901548944257173, 42.701871994102405], [-0.889633334595741, 42.69465605072263], [-0.880122999141811, 42.69395800876539], [-0.881838923268298, 42.691243256725976], [-0.879954906385831, 42.688137666631214], [-0.882712659747921, 42.68564933005886], [-0.88234480502897, 42.683184141261606], [-0.884270917863944, 42.682535350930785], [-0.887730278819141, 42.66761495414608], [-0.892871485412162, 42.66677314619847], [-0.8930943466544, 42.66234681271037], [-0.897846709391865, 42.66180379475465], [-0.90214839992771, 42.65688495264293], [-0.927643752806048, 42.656241817077195], [-0.923377446010883, 42.64697028683809], [-0.911300612112182, 42.63350403903003], [-0.904661321052369, 42.61294107966461], [-0.905552017724558, 42.61001272099666], [-0.90865991731644, 42.60967329094644], [-0.910532515713315, 42.60434941210747], [-0.913429524114084, 42.6037449252402], [-0.914683700709795, 42.60232693569202], [-0.904847746626663, 42.60084158066885], [-0.904712906807585, 42.59904710475609], [-0.908671050137708, 42.58712461470237], [-0.924790337849313, 42.58796725374574], [-0.928211390149204, 42.5803477738769], [-0.934168503277142, 42.57264789167373], [-0.93037503281666, 42.57020204115406], [-0.927914926342478, 42.57164343222727], [-0.921605072650283, 42.57124086302276], [-0.923244327363889, 42.564066424221224], [-0.919741514000132, 42.56316534919959], [-0.918602817630754, 42.55528308695359], [-0.908263769259284, 42.55922806912099], [-0.899346108992163, 42.55998332107681], [-0.895146397003957, 42.550846963951074], [-0.895711581048136, 42.54236540290014], [-0.898261397778178, 42.53896325720578], [-0.909781518745839, 42.538948982784355], [-0.916447823942846, 42.53732344002854], [-0.927803961048748, 42.52275185672912], [-0.929257820555663, 42.51375484613212], [-0.933218959767328, 42.510278372259215], [-0.933424843749008, 42.50587847973181], [-0.931568666555498, 42.50422400170579], [-0.926662245441763, 42.50280245972979], [-0.913252685360488, 42.5038376821161], [-0.912381006022899, 42.5077210406599], [-0.899945856615161, 42.51196932520893], [-0.892993779359968, 42.50985149505749], [-0.891406856003282, 42.50492337706677], [-0.893892420732544, 42.50049349675592], [-0.892561034836512, 42.499190253109596], [-0.89308450471209, 42.49375167903555], [-0.892663968293352, 42.49178076966748], [-0.890290027322906, 42.49036825164797], [-0.897019964683074, 42.479082298665354], [-0.890115298711977, 42.47638879918415], [-0.879598505186737, 42.469728721198884], [-0.877246710382996, 42.46661433562362], [-0.877718900828984, 42.461643164099065], [-0.881899298140235, 42.457055763827064], [-0.889546874444519, 42.4596463707657], [-0.89185754257794, 42.458923466106135], [-0.896296021378745, 42.46039190715926], [-0.896425144319319, 42.456900198103966], [-0.903758885196029, 42.45324340983725], [-0.906367891021773, 42.449760984941925], [-0.896280035858265, 42.44380372098698], [-0.905510573050631, 42.43681356788451], [-0.904411958610979, 42.4347582470533], [-0.898604607217293, 42.43137390824434], [-0.896016301270642, 42.42807543981672], [-0.878530190023275, 42.418531441634165], [-0.848878416767035, 42.41025188703322], [-0.84208642109211, 42.40738651413009], [-0.84169846656862, 42.404524462907844], [-0.842924772034336, 42.40313373123801], [-0.840658037806559, 42.40191133799673], [-0.840570982970695, 42.398784793964616], [-0.835434208665269, 42.39552698064972], [-0.828016584005645, 42.394305973055744], [-0.822597586885696, 42.39783230978045], [-0.815313073686626, 42.39522614601318], [-0.821671864900605, 42.38455874920128], [-0.83313000570699, 42.38199330811187], [-0.8419202"}},"Aragón","02","Zaragoza","Zaragoza","50"]
[null,null,null,null,null,null,null,null,null,null,null,null,null,null,null,"Cu 3x 240 Mm2",7.5399999999999995E-2]
[null,null,null,null,null,null,null,null,null,null,null,null,null,null,null,"Cu 3x 300 Mm2",6.0100000000000001E-2]
[null,null,null,null,null,null,null,null,null,null,null,null,null,null,null,"Cu 3x 400 Mm2",4.7E-2]
[null,null,null,null,null,null,null,null,null,null,null,null,null,null,null,"Cu 4x 1,5 Mm2",12.1]
[null,null,null,null,null,null,null,null,null,null,null,null,null,null,null,"Cu 4x 2,5 Mm2",7.41]
[null,null,null,null,null,null,null,null,null,null,null,null,null,null,null,"Cu 4x 4 Mm2",4.6100000000000003]
[null,null,null,null,null,null,null,null,null,null,null,null,null,null,null,"Cu 4x 6 Mm2",3.08]
[null,null,null,null,null,null,null,null,null,null,null,null,null,null,null,"Cu 4x 10 Mm2",1.83]
[null,null,null,null,null,null,null,null,null,null,null,null,null,null,null,"Cu 4x 16 Mm2",1.1499999999999999]
[null,null,null,null,null,null,null,null,null,null,null,null,null,null,null,"Cu 4x 25 Mm2",0.72699999999999998]
[null,null,null,null,null,null,null,null,null,null,null,null,null,null,null,"Cu 4x 35 Mm2",0.52400000000000002]
[null,null,null,null,null,null,null,null,null,null,null,null,null,null,null,"Cu 4x 50 Mm2",0.38700000000000001]
[null,null,null,null,null,null,null,null,null,null,null,null,null,null,null,"Cu 4x70 Mm2",0.26800000000000002]
[null,null,null,null,null,null,null,null,null,null,null,null,null,null,null,"Cu 4x 95 Mm2",0.193]